{"text_format":"1","workbook":"xlsx","n_sheets":15,"sheets":["Start","Award","Data","Drop Down","Sheet1","Certificate","Cert Unit Data","Cert Validation","Extended Certificate","Ext Cert Unit Data","Diploma","Diploma Validation","Ext Cert Validation","Diploma Unit Data","Sheet1 (2)"],"not_rendered":{"charts":0,"images":9,"macros":1,"external_links":3,"defined_names":322,"comments":0,"pivot_tables":0},"unopened":[],"bounds":{"document_bytes":16777216,"sheet_cells":100000,"rows_first":2000,"rows_last":500,"rows_between":2000,"halvings":0,"cell_chars":16384,"cell_head_chars":4096},"cells_cut":0,"cells_raw":0,"read":"whole","date_system":"1900"}

{"sheet":"Start","index":0,"n_rows":21,"n_cols":43,"rows_kept":21,"cut":false,"hidden":false,"merged":[[6,8,6,9],[7,6,14,15],[17,7,18,7],[17,9,18,9]]}
[" "]
[null,null," ",null,null,null," "]
[]
[]
[]
[]
[]
[null,null,null,null,null,null,"For the best experience please enable Macros. The workbook will function without but it is recommended.",null,null,null,null,null,null,null,null,null,null,null,null,null,null,null,null,null,null,null,null,null,null,null,null,null,null,null,null,null,null,null,null,null,null,null,30]
[null,null,null,null,null,null,null,null,null,null,null,null,null,null,null,null,null,null,null,null,null,null,null,null,null,null,null,null,null,null,null,null,null,null,null,null,null,null,null,null,null,null,60]
[]
[]
[]
[]
[]
[]
[]
[]
[]
[]
[]
[null,null,null,null,null,null,null,"Extended Certificate",null,"Diploma"]

{"sheet":"Award","index":1,"n_rows":16,"n_cols":43,"rows_kept":16,"cut":false,"hidden":false,"merged":[[6,8,6,9],[14,13,15,13]]}
[]
[null,null,null,null,null,null,null,"Award"]
[]
[]
[null,null,null,null,null,"Start ->","Select Sector","Sport"]
[]
[null,null,null,null,null,null,null,null,"Award - 120 GLH"]
[null,null,null,null,null,null,"Type","Unit","GLH","Grade",null,"Points",null,null,null,null,null,null,null,null,null,null,null,null,null,null,null,null,null,null,null,null,null,null,null,null,null,null,null,null,null,null,30]
[null,null,null,null,null,"Core",{"$f":"IF(ISERROR(VLOOKUP(H9,Data!B3:D19,3,FALSE)),\"\",VLOOKUP(H9,Data!B3:D19,3,FALSE))","v":"External"},{"$f":"IF(ISERROR(IF($H$5=\"Information and Creative Technology\",Data!B19,VLOOKUP(H5,Data!A3:B19,2,FALSE))),\"\",IF($H$5=\"Information and Creative Technology\",Data!B19,VLOOKUP(H5,Data!A3:B19,2,FALSE)))","v":"Unit 1 - Fitness for Sport and Exercise"},{"$f":"IF(ISERROR(VLOOKUP(H9,Data!$B$3:$D$19,2,FALSE)),\"\",VLOOKUP(H9,Data!$B$3:$D$19,2,FALSE))","v":30},"L1",{"$f":"IF(J9=\"U\",0,IF(J9=\"L1\",2,IF(J9=\"P\",4,IF(J9=\"M\",6,IF(J9=\"D\",8)))))","v":2},{"$f":"IF(ISERROR(IF(J9=\"\",\"\",K9*(I9/10))),\"\",IF(J9=\"\",\"\",K9*(I9/10)))","v":6},null,{"$f":"L9+L10","v":18},null,null,null,null,null,null,null,null,null,null,null,null,null,null,null,null,null,null,null,null,null,null,null,null,null,null,null,null,60]
[null,null,null,null,null,"Core",{"$f":"IF(ISERROR(VLOOKUP(H10,Data!G3:I19,3,FALSE)),\"\",VLOOKUP(H10,Data!G3:I19,3,FALSE))","v":"Internal"},{"$f":"IF(ISERROR(VLOOKUP(H5,Data!F3:G19,2,FALSE)),\"\",VLOOKUP(H5,Data!F3:G19,2,FALSE))","v":"Unit 2 - Practical Sports Performance "},{"$f":"IF(ISERROR(VLOOKUP(H10,Data!G3:I19,2,FALSE)),\"\",VLOOKUP(H10,Data!G3:I19,2,FALSE))","v":30},"P",{"$f":"IF(J10=\"U\",0,IF(J10=\"L1\",2,IF(J10=\"P\",4,IF(J10=\"M\",6,IF(J10=\"D\",8)))))","v":4},{"$f":"IF(ISERROR(IF(J10=\"\",\"\",K10*(I10/10))),\"\",IF(J10=\"\",\"\",K10*(I10/10)))","v":12},null,{"$f":"SUM(L9:L12)","v":54}]
[null,null,null,null,null,{"$f":"IF(OR(H5=\"Construction and the Built Environment\",H5=\"Hospitality\",H5=\"CPLD\"),\"Mandatory\",IF(OR(H5=\"Application of Science\",H5=\"Principles of Applied Science\"),\"Core\",\"Optional\"))","v":"Optional"},{"$f":"IF(ISERROR(VLOOKUP(H11,Data!$Q$3:$S$82,3,FALSE)),\"\",VLOOKUP(H11,Data!$Q$3:$S$82,3,FALSE))","v":"Internal"},"Unit 3 - The Mind and Sports Performance",{"$f":"IF(ISERROR(VLOOKUP(H11,Data!Q$3:S$82,2,FALSE)),\"\",VLOOKUP(H11,Data!Q$3:S$82,2,FALSE))","v":30},"P",{"$f":"IF(J11=\"U\",0,IF(J11=\"L1\",2,IF(J11=\"P\",4,IF(J11=\"M\",6,IF(J11=\"D\",8)))))","v":4},12,null,{"$f":"IF(OR(H5=\"Application of Science\",H5=\"Principles of Applied Science\"),N10,IF(AND(N9<24,N10<24),\"U\",IF(AND(N9<24,N9>11,N10>23),\"Level 1\",IF(AND(N9>23,N10>23),N10,IF(N9<12,\"U\")))))","v":"Level 1"}]
[null,null,null,null,null,{"$f":"IF(OR(H5=\"Application of Science\", H5=\"Principles of Applied Science\"),\"Core\", \"Optional\")","v":"Optional"},{"$f":"IF(ISERROR(VLOOKUP(H12,Data!$Q$3:$S$82,3,FALSE)),\"\",VLOOKUP(H12,Data!$Q$3:$S$82,3,FALSE))","v":"Internal"},"Unit 6 - Leading Sports Activities",{"$f":"IF(ISERROR(VLOOKUP(H12,Data!Q$3:S$82,2,FALSE)),\"\",VLOOKUP(H12,Data!Q$3:S$82,2,FALSE))","v":30},"D",{"$f":"IF(J12=\"U\",0,IF(J12=\"L1\",2,IF(J12=\"P\",4,IF(J12=\"M\",6,IF(J12=\"D\",8)))))","v":8},24,null,{"$f":"IF(ISERROR(IF(N11=\"U\",\"U\",IF(N11=\"Level 1\",\"Level 1\",VLOOKUP(N11,Sheet1!A2:B99,2,FALSE)))),\"\",IF(N11=\"U\",\"U\",IF(N11=\"Level 1\",\"Level 1\",VLOOKUP(N11,Sheet1!A2:B99,2,FALSE))))","v":"Level 1"}]
[null,null,null,null,null,null,null,null,{"$f":"IF(ISERROR(SUM(I9:I12)),\"\",SUM(I9:I12))","v":120}]
[null,null,null,null,null,null,null,null,null,null,null,null,null,null,{"$f":"IF(H5=\"Construction and the Built Environment\",\"Z\",IF(H5=\"Hospitality\",\"Y\",\"\"))","v":""}]
[null,null,null,null,null,null,null,null,null," Points",null,{"$f":"SUM(L9:L12)","v":54},null,{"$f":"IF(OR(H5=\"Application of Science\",H5=\"Principles of Applied Science\"), \"\", IF($L9+$L10<24,\"24 points across Core Units required to achieve Level 2\",\"\"))","v":"24 points across Core Units required to achieve Level 2"}]
[null,null,null,null,null,null,null,null,null," Grade",null,{"$f":"IF(I13>=120,N12,\" \")","v":"Level 1"}]

{"sheet":"Data","index":2,"n_rows":82,"n_cols":24,"rows_kept":82,"cut":false,"hidden":true,"merged":[]}
["Core Units",null,null,null,null,null,null,null,null,null,"Mandatory Units",null,null,null,null,"Award Units",null,null,null,null,"Certificate Units - Group A"]
["Sector","Unit Name","GLH",null,null,"Sector","Unit Name","GLH",null,null,"Sector","Unit Name","GLH",null,null,"Sector","Unit Name","GLH",null,null,"Sector","Unit Name","GLH"]
["Animal Care","Unit 1 - Animal Health",30,"External",null,"Animal Care","Unit 2 - Animal Handling",30,"Internal",null,"Media","Unit 8 - Media Industry in Context",30,"External",null,"Animal Care","Unit 3 - Animal Welfare",30,"Internal",null,"Media","Unit 3 - Digital Moving Image Production",30,"Internal"]
["Application of Science","Unit 5 - Application of Chemical Substances",30,"Internal",null,"Application of Science","Unit 6 - Application of Physical Science ",30,"Internal",null,"Music","Unit 8 - Music and Production Analysis",30,"External",null,"Animal Care","Unit 4 - Animal Housing and Accommodation",30,"Internal",null,"Media","Unit 4 - Digital Audio Production",30,"Internal"]
["Art and Design","Unit 1 - Introduction to Specialist Pathways in Art and Design ",30,"Internal",null,"Art and Design","Unit 2 - Creative Project in Art and Design",30,"External",null,"Information and Creative Technology","Unit 1 - The Online World ",30,"External",null,"Animal Care","Unit 5 - Principles of Animal Behaviour",30,"Internal",null,"Media","Unit 5 - Digital Publishing Production",30,"Internal"]
["Business","Unit 1 - Enterprise in the Business World",30,"Internal",null,"Business","Unit 2 - Finance for Business",30,"External",null,"Information and Creative Technology","Unit 2 - Technology Systems ",30,"External",null,"Application of Science","Unit 7 - Health Applications of Life Science ",30,"Internal",null,"Media","Unit 6 - Website Production ",30,"Internal"]
["CPLD","Unit 1 - Patterns of Child Development",30,"External",null,"CPLD","Unit 2 - Promoting Children’s Development Through Play",30,"Internal",null,null,null,null,null,null,"Application of Science","Unit 8 - Scientific Skills ",30,"External",null,"Media","Unit 7 - Digital Games Production",30,"Internal"]
["Construction and the Built Environment","Unit 1 - Construction Technology ",30,"External",null,"Construction and the Built Environment","Unit 2 - Construction and Design",30,"Internal",null,null,null,null,null,null,"Art and Design","Unit 3 - Communicating Ideas in 2D",30,"Internal",null,"Media","Unit 9 - Digital Editing for Moving Image",60,"Internal"]
["Creative Digital Media Production","Unit 1 - Digital Media Sectors and Audiences",30,"External",null,"Creative Digital Media Production","Unit 2 - Planning and Pitching a Digital Media Product ",30,"Internal",null,null,null,null,null,null,"Art and Design","Unit 4 - Communicating Ideas in 3D ",30,"Internal",null,"Media","Unit 10 - Digital Photography for a Media Product",60,"Internal"]
["Engineering","Unit 1 - The Engineered World",30,"External",null,"Engineering","Unit 2 - Investigating an Engineering Product ",30,"Internal",null,null,null,null,null,null,"Art and Design","Unit 5 - Developing an Art and Design Portfolio ",30,"Internal",null,"Media","Unit 11 - Animation for Digital Media",60,"Internal"]
["Health and Social Care","Unit 1 - Human Lifespan Development",30,"External",null,"Health and Social Care","Unit 2 - Health and Social Care Values",30,"Internal",null,null,null,null,null,null,"Art and Design","Unit 6 - Investigating Contextual References in Art and Design ",30,"Internal",null,"Media","Unit 12 - Digital Audio Editing ",30,"Internal"]
["Hospitality","Unit 1 - Introducing the Hospitality Industry",30,"External",null,"Hospitality","Unit 2 - Working in the Hospitality Industry",30,"Internal",null,null,null,null,null,null,"Business","Unit 3 - Promoting a Brand",30,"Internal",null,"Media","Unit 13 - Graphic Design for Digital Media",30,"Internal"]
["Music","Unit 1 - The Music Industry",30,"External",null,"Information and Creative Technology","Unit 3 - A Digital Portfolio",30,"Internal",null,null,null,null,null,null,"Business","Unit 4 - Principles of Customer Service",30,"Internal",null,"Media","Unit 14 - Writing for Digital Media",30,"Internal"]
["Performing Arts","Unit 1 - Individual Showcase ",30,"External",null,"Music","Unit 2 - Managing a Music Product ",30,"Internal",null,null,null,null,null,null,"Business","Unit 5 - Sales and Personal Selling ",30,"Internal",null,"Media","Unit 15 - Digital Games Testing ",30,"Internal"]
["Principles of Applied Science","Unit 1 - Principles of Science",30,"External",null,"Principles of Applied Science","Unit 2 - Chemistry and Our Earth",30,"Internal",null,null,null,null,null,null,"Business","Unit 6 - Introducing Retail Business",30,"Internal",null,"Music","Unit 3 - Introducing Live Sound",30,"Internal"]
["Public Services","Unit 1 - The Role and Work of the Public Services",30,"External",null,"Performing Arts","Unit 2 - Preparation, Performance and Production ",30,"Internal",null,null,null,null,null,null,"Business","Unit 7 - Providing Business Support ",30,"Internal",null,"Music","Unit 4 - Introducing Music Composition",30,"Internal"]
["Sport","Unit 1 - Fitness for Sport and Exercise",30,"External",null,"Public Services","Unit 2 - Working Skills in the Public Service Sector",30,"Internal",null,null,null,null,null,null,"Business","Unit 8 - Recruitment, Selection and Employment ",30,"Internal",null,"Music","Unit 5 - Introducing Music Performance",30,"Internal"]
["Travel and Tourism","Unit 1 - The UK Travel and Tourism Sector",30,"External",null,"Sport","Unit 2 - Practical Sports Performance ",30,"Internal",null,null,null,null,null,null,"CPLD","Unit 3 - The Principles of Early Years Practice",60,"Internal",null,"Music","Unit 6 - Introducing Music Recording",30,"Internal"]
["Information and Creative Technology","Unit 1 or 2 - Optional Core Unit",30,"External",null,"Travel and Tourism","Unit 2 - UK Travel and Tourism Destinations ",30,"Internal",null,null,null,null,null,null,"Construction and the Built Environment","Unit 3 - Scientific and Mathematical Applications for Construction",30,"Internal",null,"Music","Unit 7 - Introducing Music Sequencing",30,"Internal"]
[null,null,null,null,null,null,null,null,null,null,null,null,null,null,null,"Construction and the Built Environment","Unit 4 - Construction Processes and Operations",30,"Internal",null,"Music","Unit 9 - Introducing Choral Studies",30,"Internal"]
[null,null,null,null,null,null,null,null,null,null,null,null,null,null,null,"Construction and the Built Environment","Unit 5 - Construction Drawing Techniques",30,"Internal",null,"Music","Unit 10 - Introducing Music Theory",30,"Internal"]
["U",null,null,null,null,null,null,null,null,null,null,null,null,null,null,"Construction and the Built Environment","Unit 6 - Exploring Carpentry and Joinery Principles and Techniques",30,"Internal",null,"Music","Unit 11 - Developing Solo Music Performance ",60,"Internal"]
["L1",null,null,null,null,null,null,null,null,null,null,null,null,null,null,"Construction and the Built Environment","Unit 7 - Exploring Brickwork and Blockwork Principles and Techniques",30,"Internal",null,"Music","Unit 12 - The Development of Music",60,"Internal"]
["P",null,null,null,null,"Information and Creative Technology","Unit 1 - ICT TEST",30,"Internal",null,null,null,null,null,null,"Construction and the Built Environment","Unit 8 - Exploring Painting and Decorating Principles and Techniques",30,"Internal",null,"Music","Unit 13 - Developing Music Composition ",60,"Internal"]
["M",null,null,null,null,"Information and Creative Technology","Unit 2 - ICT TEST",30,"Internal",null,null,null,null,null,null,"Construction and the Built Environment","Unit 9 - Exploring Plumbing Principles and Techniques",30,"Internal",null,"Music","Unit 14 - Producing a Music Recording ",60,"Internal"]
["D",null,null,null,null,null,null,null,null,null,null,null,null,null,null,"Construction and the Built Environment","Unit 10 - Exploring Electrical Principles and Techniques",30,"Internal",null,"Music","Unit 15 - Music Ensemble ",60,"Internal"]
[null,null,null,null,null,null,null,null,null,null,null,null,null,null,null,"Creative Digital Media Production","Unit 3 - Digital Moving Image Production",30,"Internal"]
[null,null,null,null,null,null,null,null,null,null,null,null,null,null,null,"Creative Digital Media Production","Unit 4 - Digital Audio Production",30,"Internal"]
[null,null,null,null,null,null,null,null,null,null,null,null,null,null,null,"Creative Digital Media Production","Unit 5 - Digital Publishing Production",30,"Internal"]
[null,null,null,null,null,null,null,null,null,null,null,null,null,null,null,"Creative Digital Media Production","Unit 6 - Website Production ",30,"Internal"]
[null,null,null,null,null,null,null,null,null,null,null,null,null,null,null,"Creative Digital Media Production","Unit 7 - Digital Games Production",30,"Internal"]
[null,null,null,null,null,null,null,null,null,null,null,null,null,null,null,"Engineering","Unit 3 - Health and Safety in Engineering",30,"Internal"]
[null,null,null,null,null,null,null,null,null,null,null,null,null,null,null,"Engineering","Unit 4 - Engineering Maintenance",30,"Internal"]
[null,null,null,null,null,null,null,null,null,null,null,null,null,null,null,"Engineering","Unit 5 - Engineering Materials",30,"Internal"]
[null,null,null,null,null,null,null,null,null,null,null,null,null,null,null,"Engineering","Unit 6 - Computer-aided Engineering",30,"Internal"]
[null,null,null,null,null,null,null,null,null,null,null,null,null,null,null,"Engineering","Unit 7 - Machining Techniques",60,"Internal"]
[null,null,null,null,null,null,null,null,null,null,null,null,null,null,null,"Engineering","Unit 8 - Electronic Circuit Design and Construction",60,"Internal"]
[null,null,null,null,null,null,null,null,null,null,null,null,null,null,null,"Health and Social Care","Unit 3 - Effective Communication in Health and Social Care ",30,"Internal"]
[null,null,null,null,null,null,null,null,null,null,null,null,null,null,null,"Health and Social Care","Unit 4 - Social Influences on Health and Wellbeing ",30,"Internal"]
[null,null,null,null,null,null,null,null,null,null,null,null,null,null,null,"Health and Social Care","Unit 5 - Promoting Health and Wellbeing ",30,"Internal"]
[null,null,null,null,null,null,null,null,null,null,null,null,null,null,null,"Health and Social Care","Unit 6 - The Impact of Nutrition on Health and Wellbeing ",30,"Internal"]
[null,null,null,null,null,null,null,null,null,null,null,null,null,null,null,"Health and Social Care","Unit 7 - Equality and Diversity in Health and Social Care ",30,"Internal"]
[null,null,null,null,null,null,null,null,null,null,null,null,null,null,null,"Health and Social Care","Unit 8 - Individual Rights in Health and Social Care",30,"Internal"]
[null,null,null,null,null,null,null,null,null,null,null,null,null,null,null,"Hospitality","Unit 3 - Food Safety and Health and Safety in Hospitality",30,"Internal"]
[null,null,null,null,null,null,null,null,null,null,null,null,null,null,null,"Hospitality","Unit 4 - Costing and Controlling Finances in the Hospitality Industry",30,"Internal"]
[null,null,null,null,null,null,null,null,null,null,null,null,null,null,null,"Hospitality","Unit 5 - Enterprise in the Hospitality Industry",30,"Internal"]
[null,null,null,null,null,null,null,null,null,null,null,null,null,null,null,"Hospitality","Unit 6 - Planning, Preparing, Cooking and Finishing Food",30,"Internal"]
[null,null,null,null,null,null,null,null,null,null,null,null,null,null,null,"Hospitality","Unit 7 - Food and Beverage Service in the Hospitality Industry",30,"Internal"]
[null,null,null,null,null,null,null,null,null,null,null,null,null,null,null,"Hospitality","Unit 8 - Front Office Services in the Hospitality Industry",30,"Internal"]
[null,null,null,null,null,null,null,null,null,null,null,null,null,null,null,"Information and Creative Technology","Unit 4 - Creating Digital Animation",30,"Internal"]
[null,null,null,null,null,null,null,null,null,null,null,null,null,null,null,"Information and Creative Technology","Unit 5 - Creating Digital Audio",30,"Internal"]
[null,null,null,null,null,null,null,null,null,null,null,null,null,null,null,"Information and Creative Technology","Unit 6 - Creating Digital Graphics",30,"Internal"]
[null,null,null,null,null,null,null,null,null,null,null,null,null,null,null,"Information and Creative Technology","Unit 7 - Creating Digital Video",30,"Internal"]
[null,null,null,null,null,null,null,null,null,null,null,null,null,null,null,"Information and Creative Technology","Unit 8 - Mobile Apps Development",30,"Internal"]
[null,null,null,null,null,null,null,null,null,null,null,null,null,null,null,"Information and Creative Technology","Unit 9 - Spreadsheet Development",30,"Internal"]
[null,null,null,null,null,null,null,null,null,null,null,null,null,null,null,"Information and Creative Technology","Unit 10 - Database Development",60,"Internal"]
[null,null,null,null,null,null,null,null,null,null,null,null,null,null,null,"Information and Creative Technology","Unit 11 - Computer Networks",60,"Internal"]
[null,null,null,null,null,null,null,null,null,null,null,null,null,null,null,"Information and Creative Technology","Unit 12 - Software Development",60,"Internal"]
[null,null,null,null,null,null,null,null,null,null,null,null,null,null,null,"Information and Creative Technology","Unit 13 - Website Development",60,"Internal"]
[null,null,null,null,null,null,null,null,null,null,null,null,null,null,null,"Music","Unit 3 - Introducing Live Sound",30,"Internal"]
[null,null,null,null,null,null,null,null,null,null,null,null,null,null,null,"Music","Unit 4 - Introducing Music Composition",30,"Internal"]
[null,null,null,null,null,null,null,null,null,null,null,null,null,null,null,"Music","Unit 5 - Introducing Music Performance",30,"Internal"]
[null,null,null,null,null,null,null,null,null,null,null,null,null,null,null,"Music","Unit 6 - Introducing Music Recording",30,"Internal"]
[null,null,null,null,null,null,null,null,null,null,null,null,null,null,null,"Music","Unit 7 - Introducing Music Sequencing",30,"Internal"]
[null,null,null,null,null,null,null,null,null,null,null,null,null,null,null,"Performing Arts","Unit 3 - Acting Skills",60,"Internal"]
[null,null,null,null,null,null,null,null,null,null,null,null,null,null,null,"Performing Arts","Unit 4 - Dance Skills",60,"Internal"]
[null,null,null,null,null,null,null,null,null,null,null,null,null,null,null,"Performing Arts","Unit 5 - Musical Theatre Skills ",60,"Internal"]
[null,null,null,null,null,null,null,null,null,null,null,null,null,null,null,"Performing Arts","Unit 6 - Music Performance Skills",60,"Internal"]
[null,null,null,null,null,null,null,null,null,null,null,null,null,null,null,"Performing Arts","Unit 7 - Production Skills for Performance",60,"Internal"]
[null,null,null,null,null,null,null,null,null,null,null,null,null,null,null,"Principles of Applied Science","Unit 3 - Energy and Our Universe",30,"Internal"]
[null,null,null,null,null,null,null,null,null,null,null,null,null,null,null,"Principles of Applied Science","Unit 4 - Biology and Our Environment",30,"Internal"]
[null,null,null,null,null,null,null,null,null,null,null,null,null,null,null,"Public Services","Unit 3 - Employment in the Public Services",30,"Internal"]
[null,null,null,null,null,null,null,null,null,null,null,null,null,null,null,"Public Services","Unit 4 - Public Services and Community Protection ",30,"Internal"]
[null,null,null,null,null,null,null,null,null,null,null,null,null,null,null,"Public Services","Unit 5 - Health, Fitness and Lifestyle for the Public Services",30,"Internal"]
[null,null,null,null,null,null,null,null,null,null,null,null,null,null,null,"Sport","Unit 3 - The Mind and Sports Performance",30,"Internal"]
[null,null,null,null,null,null,null,null,null,null,null,null,null,null,null,"Sport","Unit 4 - The Sports Performer in Action",30,"Internal"]
[null,null,null,null,null,null,null,null,null,null,null,null,null,null,null,"Sport","Unit 5 - Training for Personal Fitness",30,"Internal"]
[null,null,null,null,null,null,null,null,null,null,null,null,null,null,null,"Sport","Unit 6 - Leading Sports Activities",30,"Internal"]
[null,null,null,null,null,null,null,null,null,null,null,null,null,null,null,"Travel and Tourism","Unit 3 - The Development of Travel and Tourism in the UK ",30,"Internal"]
[null,null,null,null,null,null,null,null,null,null,null,null,null,null,null,"Travel and Tourism","Unit 4 - International Travel and Tourism Destinations ",30,"Internal"]
[null,null,null,null,null,null,null,null,null,null,null,null,null,null,null,"Travel and Tourism","Unit 5 - Factors Affecting Worldwide Travel and Tourism",30,"Internal"]
[null,null,null,null,null,null,null,null,null,null,null,null,null,null,null,"Travel and Tourism","Unit 6 -The Travel and Tourism Customer Experience ",30,"Internal"]

{"sheet":"Drop Down","index":3,"n_rows":26,"n_cols":83,"rows_kept":26,"cut":false,"hidden":true,"merged":[]}
["Art and Design",null,null,null,"Business",null,null,null,"CPLD",null,null,null,"Construction",null,null,null,"CDMP",null,null,null,"Engineering",null,null,null,"H&SC",null,null,null,"Hospitality",null,null,null,"ICT Mand",null,null,null,"ICT Opt",null,null,null,"Music",null,null,null,"Performing Arts",null,null,null,"Sport",null,null,null,"Travel and Tourism",null,null,null,"Applied Science",null,null,null,"Public Services",null,null,null,"Principles of Applied Science",null,null,null,"ICT Opt",null,null,null,null,null,null,null,"Hosp Mand",null,null,null,"Animal Care"]
["Unit 3 - Communicating Ideas in 2D",{"$f":"IF(COUNTIF(Award!H11:H12,A2)>=1,\"\",ROW())","v":2},{"$f":"IF(ROW(A2)-ROW(A$2)+1>COUNT(B$2:B$5),\"\",INDEX(A:A,SMALL(B$2:B$5,1+ROW(A2)-ROW(A$2))))","v":"Unit 3 - Communicating Ideas in 2D"},null,"Unit 3 - Promoting a Brand",{"$f":"IF(COUNTIF(Award!H11:H12,E2)>=1,\"\",ROW())","v":2},{"$f":"IF(ROW(E2)-ROW($E$2)+1>COUNT(F$2:F$7),\"\",INDEX(E:E,SMALL(F$2:F$7,1+ROW(E2)-ROW($E$2))))","v":"Unit 3 - Promoting a Brand"},null,"Unit 3 - The Principles of Early Years Practice",{"$f":"IF(COUNTIF(Award!H11:H12,I2)>=1,\"\",ROW())","v":2},{"$f":"IF(ROW(I2)-ROW(I$2)+1>COUNT(J$2:J$7),\"\",INDEX(I:I,SMALL(J$2:J$7,1+ROW(I2)-ROW(I$2))))","v":"Unit 3 - The Principles of Early Years Practice"},null,"Unit 4 - Construction Processes and Operations",{"$f":"IF(COUNTIF(Award!$H$11:$H$12,M2)>=1,\"\",ROW())","v":2},{"$f":"IF(ROW(M2)-ROW(M$2)+1>COUNT(N$2:N$8),\"\",INDEX(M:M,SMALL(N$2:N$8,1+ROW(M2)-ROW(M$2))))","v":"Unit 4 - Construction Processes and Operations"},null,"Unit 3 - Digital Moving Image Production",{"$f":"IF(COUNTIF(Award!$H$11:$H$12,Q2)>=1,\"\",ROW())","v":2},{"$f":"IF(ROW(Q2)-ROW(Q$2)+1>COUNT(R$2:R$7),\"\",INDEX(Q:Q,SMALL(R$2:R$7,1+ROW(Q2)-ROW(Q$2))))","v":"Unit 3 - Digital Moving Image Production"},null,"Unit 3 - Health and Safety in Engineering",{"$f":"IF(COUNTIF(Award!$H$11:$H$12,U2)>=1,\"\",ROW())","v":2},{"$f":"IF(ROW(U2)-ROW(U$2)+1>COUNT(V$2:V$7),\"\",INDEX(U:U,SMALL(V$2:V$7,1+ROW(U2)-ROW(U$2))))","v":"Unit 3 - Health and Safety in Engineering"},null,"Unit 3 - Effective Communication in Health and Social Care ",{"$f":"IF(COUNTIF(Award!$H$11:$H$12,Y2)>=1,\"\",ROW())","v":2},{"$f":"IF(ROW(Y2)-ROW(Y$2)+1>COUNT(Z$2:Z$7),\"\",INDEX(Y:Y,SMALL(Z$2:Z$7,1+ROW(Y2)-ROW(Y$2))))","v":"Unit 3 - Effective Communication in Health and Social Care "},null,"Unit 4 - Costing and Controlling Finances in the Hospitality Industry",{"$f":"IF(COUNTIF(Award!$H$11:$H$12,AC2)>=1,\"\",ROW())","v":2},{"$f":"IF(ROW(AC2)-ROW(AC$2)+1>COUNT(AD$2:AD$6),\"\",INDEX(AC:AC,SMALL(AD$2:AD$6,1+ROW(AC2)-ROW(AC$2))))","v":"Unit 4 - Costing and Controlling Finances in the Hospitality Industry"},null,"Unit 1 - The Online World ",{"$f":"IF(COUNTIF(#REF!,AG2)>=1,\"\",ROW())","v":{"$error":"#REF!"}},{"$f":"IF(ROW(AG2)-ROW(AG$2)+1>COUNT(AH$2:AH$3),\"\",INDEX(AG:AG,SMALL(AH$2:AH$3,1+ROW(AG2)-ROW(AG$2))))","v":""},null,"Unit 4 - Creating Digital Animation",{"$f":"IF(COUNTIF(Award!$H$11:$H$12,AK2)>=1,\"\",ROW())","v":2},{"$f":"IF(ROW(AK2)-ROW(AK$2)+1>COUNT(AL$2:AL$11),\"\",INDEX(AK:AK,SMALL(AL$2:AL$11,1+ROW(AK2)-ROW(AK$2))))","v":"Unit 4 - Creating Digital Animation"},null,"Unit 3 - Introducing Live Sound",{"$f":"IF(COUNTIF(Award!$H$11:$H$12,AO2)>=1,\"\",ROW())","v":2},{"$f":"IF(ROW(AO2)-ROW(AO$2)+1>COUNT(AP$2:AP$6),\"\",INDEX(AO:AO,SMALL(AP$2:AP$6,1+ROW(AO2)-ROW(AO$2))))","v":"Unit 3 - Introducing Live Sound"},null,"Unit 3 - Acting Skills",{"$f":"IF(COUNTIF(Award!$H$11:$H$12,AS2)>=1,\"\",ROW())","v":2},{"$f":"IF(ROW(AS2)-ROW(AS$2)+1>COUNT(AT$2:AT$6),\"\",INDEX(AS:AS,SMALL(AT$2:AT$6,1+ROW(AS2)-ROW(AS$2))))","v":"Unit 3 - Acting Skills"},null,"Unit 3 - The Mind and Sports Performance",{"$f":"IF(COUNTIF(Award!$H$11:$H$12,AW2)>=1,\"\",ROW())","v":""},{"$f":"IF(ROW(AW2)-ROW(AW$2)+1>COUNT(AX$2:AX$5),\"\",INDEX(AW:AW,SMALL(AX$2:AX$5,1+ROW(AW2)-ROW(AW$2))))","v":"Unit 4 - The Sports Performer in Action"},null,"Unit 3 - The Development of Travel and Tourism in the UK ",{"$f":"IF(COUNTIF(Award!$H$11:$H$12,BA2)>=1,\"\",ROW())","v":2},{"$f":"IF(ROW(BA2)-ROW(BA$2)+1>COUNT(BB$2:BB$5),\"\",INDEX(BA:BA,SMALL(BB$2:BB$5,1+ROW(BA2)-ROW(BA$2))))","v":"Unit 3 - The Development of Travel and Tourism in the UK "},null,"Unit 7 - Health Applications of Life Science ",{"$f":"IF(COUNTIF(Award!$H$11:$H$12,BE2)>=1,\"\",ROW())","v":2},{"$f":"IF(ROW(BE2)-ROW(BE$2)+1>COUNT(BF$2:BF$3),\"\",INDEX(BE:BE,SMALL(BF$2:BF$3,1+ROW(BE2)-ROW(BE$2))))","v":"Unit 7 - Health Applications of Life Science "},null,"Unit 3 - Employment in the Public Services",{"$f":"IF(COUNTIF(Award!$H$11:$H$12,BI2)>=1,\"\",ROW())","v":2},{"$f":"IF(ROW(BI2)-ROW(BI$2)+1>COUNT(BJ$2:BJ$4),\"\",INDEX(BI:BI,SMALL(BJ$2:BJ$4,1+ROW(BI2)-ROW(BI$2))))","v":"Unit 3 - Employment in the Public Services"},null,"Unit 3 - Energy and Our Universe",{"$f":"IF(COUNTIF(Award!$H$11:$H$12,BM2)>=1,\"\",ROW())","v":2},{"$f":"IF(ROW(BM2)-ROW(BM$2)+1>COUNT(BN$2:BN$3),\"\",INDEX(BM:BM,SMALL(BN$2:BN$3,1+ROW(BM2)-ROW(BM$2))))","v":"Unit 3 - Energy and Our Universe"},null,"Unit 4 - Creating Digital Animation",{"$f":"IF(COUNTIF(Award!$H$11:$H$12,BQ2)>=1,\"\",ROW())","v":2},{"$f":"IF(ROW(BQ2)-ROW(BQ$2)+1>COUNT(BR$2:BR$11),\"\",INDEX(BQ:BQ,SMALL(BR$2:BR$11,1+ROW(BQ2)-ROW(BQ$2))))","v":"Unit 4 - Creating Digital Animation"},null,"Unit 3 - Scientific and Mathematical Applications for Construction",{"$f":"IF(COUNTIF(Award!$H$11:$H$12,BU2)>=1,\"\",ROW())","v":2},{"$f":"IF(ROW(BU2)-ROW(BU$2)+1>COUNT(BV$2:BV$9),\"\",INDEX(BU:BU,SMALL(BV$2:BV$9,1+ROW(BU2)-ROW(BU$2))))","v":"Unit 3 - Scientific and Mathematical Applications for Construction"},null,"Unit 3 - Food Safety and Health and Safety in Hospitality",{"$f":"IF(COUNTIF(Award!$H$11:$H$12,BY2)>=1,\"\",ROW())","v":2},{"$f":"IF(ROW(BY2)-ROW(BY$2)+1>COUNT(BZ$2),\"\",INDEX(BY:BY,SMALL(BZ$2,1+ROW(BY2)-ROW(BY$2))))","v":"Unit 3 - Food Safety and Health and Safety in Hospitality"},null,"Unit 3 - Animal Welfare",{"$f":"IF(COUNTIF(Award!$H$11:$H$12,CC2)>=1,\"\",ROW())","v":2},{"$f":"IF(ROW(CC2)-ROW(CC$2)+1>COUNT(CD$2:CD$4),\"\",INDEX(CC:CC,SMALL(CD$2:CD$4,1+ROW(CC2)-ROW(CC$2))))","v":"Unit 3 - Animal Welfare"}]
["Unit 4 - Communicating Ideas in 3D ",{"$f":"IF(COUNTIF(Award!H11:H12,A3)>=1,\"\",ROW())","v":3},{"$f":"IF(ROW(A3)-ROW(A$2)+1>COUNT(B$2:B$5),\"\",INDEX(A:A,SMALL(B$2:B$5,1+ROW(A3)-ROW(A$2))))","v":"Unit 4 - Communicating Ideas in 3D "},null,"Unit 4 - Principles of Customer Service",{"$f":"IF(COUNTIF(Award!H11:H12,E3)>=1,\"\",ROW())","v":3},"Unit 4 - Principles of Customer Service",null,null,null,null,null,"Unit 5 - Construction Drawing Techniques",{"$f":"IF(COUNTIF(Award!$H$11:$H$12,M3)>=1,\"\",ROW())","v":3},"Unit 5 - Construction Drawing Techniques",null,"Unit 4 - Digital Audio Production",{"$f":"IF(COUNTIF(Award!$H$11:$H$12,Q3)>=1,\"\",ROW())","v":3},{"$f":"IF(ROW(Q3)-ROW(Q$2)+1>COUNT(R$2:R$7),\"\",INDEX(Q:Q,SMALL(R$2:R$7,1+ROW(Q3)-ROW(Q$2))))","v":"Unit 4 - Digital Audio Production"},null,"Unit 4 - Engineering Maintenance",{"$f":"IF(COUNTIF(Award!$H$11:$H$12,U3)>=1,\"\",ROW())","v":3},"Unit 4 - Engineering Maintenance",null,"Unit 4 - Social Influences on Health and Wellbeing ",{"$f":"IF(COUNTIF(Award!$H$11:$H$12,Y3)>=1,\"\",ROW())","v":3},"Unit 4 - Social Influences on Health and Wellbeing ",null,"Unit 5 - Enterprise in the Hospitality Industry",{"$f":"IF(COUNTIF(Award!$H$11:$H$12,AC3)>=1,\"\",ROW())","v":3},{"$f":"IF(ROW(AC3)-ROW(AC$2)+1>COUNT(AD$2:AD$6),\"\",INDEX(AC:AC,SMALL(AD$2:AD$6,1+ROW(AC3)-ROW(AC$2))))","v":"Unit 5 - Enterprise in the Hospitality Industry"},null,"Unit 2 - Technology Systems ",{"$f":"IF(COUNTIF(#REF!,AG3)>=1,\"\",ROW())","v":{"$error":"#REF!"}},{"$f":"IF(ROW(AG3)-ROW(AG$2)+1>COUNT(AH$2:AH$3),\"\",INDEX(AG:AG,SMALL(AH$2:AH$3,1+ROW(AG3)-ROW(AG$2))))","v":""},null,"Unit 5 - Creating Digital Audio",{"$f":"IF(COUNTIF(Award!$H$11:$H$12,AK3)>=1,\"\",ROW())","v":3},"Unit 5 - Creating Digital Audio",null,"Unit 4 - Introducing Music Composition",{"$f":"IF(COUNTIF(Award!$H$11:$H$12,AO3)>=1,\"\",ROW())","v":3},{"$f":"IF(ROW(AO3)-ROW(AO$2)+1>COUNT(AP$2:AP$6),\"\",INDEX(AO:AO,SMALL(AP$2:AP$6,1+ROW(AO3)-ROW(AO$2))))","v":"Unit 4 - Introducing Music Composition"},null,"Unit 4 - Dance Skills",{"$f":"IF(COUNTIF(Award!$H$11:$H$12,AS3)>=1,\"\",ROW())","v":3},{"$f":"IF(ROW(AS3)-ROW(AS$2)+1>COUNT(AT$2:AT$6),\"\",INDEX(AS:AS,SMALL(AT$2:AT$6,1+ROW(AS3)-ROW(AS$2))))","v":"Unit 4 - Dance Skills"},null,"Unit 4 - The Sports Performer in Action",{"$f":"IF(COUNTIF(Award!$H$11:$H$12,AW3)>=1,\"\",ROW())","v":3},{"$f":"IF(ROW(AW3)-ROW(AW$2)+1>COUNT(AX$2:AX$5),\"\",INDEX(AW:AW,SMALL(AX$2:AX$5,1+ROW(AW3)-ROW(AW$2))))","v":"Unit 5 - Training for Personal Fitness"},null,"Unit 4 - International Travel and Tourism Destinations ",{"$f":"IF(COUNTIF(Award!$H$11:$H$12,BA3)>=1,\"\",ROW())","v":3},{"$f":"IF(ROW(BA3)-ROW(BA$2)+1>COUNT(BB$2:BB$5),\"\",INDEX(BA:BA,SMALL(BB$2:BB$5,1+ROW(BA3)-ROW(BA$2))))","v":"Unit 4 - International Travel and Tourism Destinations "},null,"Unit 8 - Scientific Skills ",{"$f":"IF(COUNTIF(Award!$H$11:$H$12,BE3)>=1,\"\",ROW())","v":3},{"$f":"IF(ROW(BE3)-ROW(BE$2)+1>COUNT(BF$2:BF$3),\"\",INDEX(BE:BE,SMALL(BF$2:BF$3,1+ROW(BE3)-ROW(BE$2))))","v":"Unit 8 - Scientific Skills "},null,"Unit 4 - Public Services and Community Protection ",{"$f":"IF(COUNTIF(Award!$H$11:$H$12,BI3)>=1,\"\",ROW())","v":3},{"$f":"IF(ROW(BI3)-ROW(BI$2)+1>COUNT(BJ$2:BJ$4),\"\",INDEX(BI:BI,SMALL(BJ$2:BJ$4,1+ROW(BI3)-ROW(BI$2))))","v":"Unit 4 - Public Services and Community Protection "},null,"Unit 4 - Biology and Our Environment",{"$f":"IF(COUNTIF(Award!$H$11:$H$12,BM3)>=1,\"\",ROW())","v":3},{"$f":"IF(ROW(BM3)-ROW(BM$2)+1>COUNT(BN$2:BN$3),\"\",INDEX(BM:BM,SMALL(BN$2:BN$3,1+ROW(BM3)-ROW(BM$2))))","v":"Unit 4 - Biology and Our Environment"},null,"Unit 5 - Creating Digital Audio",{"$f":"IF(COUNTIF(Award!$H$11:$H$12,BQ3)>=1,\"\",ROW())","v":3},"Unit 5 - Creating Digital Audio",null,null,null,null,null,null,null,null,null,"Unit 4 - Animal Housing and Accommodation",{"$f":"IF(COUNTIF(Award!$H$11:$H$12,CC3)>=1,\"\",ROW())","v":3},{"$f":"IF(ROW(CC3)-ROW(CC$2)+1>COUNT(CD$2:CD$4),\"\",INDEX(CC:CC,SMALL(CD$2:CD$4,1+ROW(CC3)-ROW(CC$2))))","v":"Unit 4 - Animal Housing and Accommodation"}]
["Unit 5 - Developing an Art and Design Portfolio ",{"$f":"IF(COUNTIF(Award!H11:H12,A4)>=1,\"\",ROW())","v":4},{"$f":"IF(ROW(A4)-ROW(A$2)+1>COUNT(B$2:B$5),\"\",INDEX(A:A,SMALL(B$2:B$5,1+ROW(A4)-ROW(A$2))))","v":"Unit 5 - Developing an Art and Design Portfolio "},null,"Unit 5 - Sales and Personal Selling ",{"$f":"IF(COUNTIF(Award!H11:H12,E4)>=1,\"\",ROW())","v":4},"Unit 5 - Sales and Personal Selling ",null,null,null,null,null,"Unit 6 - Exploring Carpentry and Joinery Principles and Techniques",{"$f":"IF(COUNTIF(Award!$H$11:$H$12,M4)>=1,\"\",ROW())","v":4},"Unit 6 - Exploring Carpentry and Joinery Principles and Techniques",null,"Unit 5 - Digital Publishing Production",{"$f":"IF(COUNTIF(Award!$H$11:$H$12,Q4)>=1,\"\",ROW())","v":4},{"$f":"IF(ROW(Q4)-ROW(Q$2)+1>COUNT(R$2:R$7),\"\",INDEX(Q:Q,SMALL(R$2:R$7,1+ROW(Q4)-ROW(Q$2))))","v":"Unit 5 - Digital Publishing Production"},null,"Unit 5 - Engineering Materials",{"$f":"IF(COUNTIF(Award!$H$11:$H$12,U4)>=1,\"\",ROW())","v":4},"Unit 5 - Engineering Materials",null,"Unit 5 - Promoting Health and Wellbeing ",{"$f":"IF(COUNTIF(Award!$H$11:$H$12,Y4)>=1,\"\",ROW())","v":4},"Unit 5 - Promoting Health and Wellbeing ",null,"Unit 6 - Planning, Preparing, Cooking and Finishing Food",{"$f":"IF(COUNTIF(Award!$H$11:$H$12,AC4)>=1,\"\",ROW())","v":4},{"$f":"IF(ROW(AC4)-ROW(AC$2)+1>COUNT(AD$2:AD$6),\"\",INDEX(AC:AC,SMALL(AD$2:AD$6,1+ROW(AC4)-ROW(AC$2))))","v":"Unit 6 - Planning, Preparing, Cooking and Finishing Food"},null,null,null,null,null,"Unit 6 - Creating Digital Graphics",{"$f":"IF(COUNTIF(Award!$H$11:$H$12,AK4)>=1,\"\",ROW())","v":4},"Unit 6 - Creating Digital Graphics",null,"Unit 5 - Introducing Music Performance",{"$f":"IF(COUNTIF(Award!$H$11:$H$12,AO4)>=1,\"\",ROW())","v":4},{"$f":"IF(ROW(AO4)-ROW(AO$2)+1>COUNT(AP$2:AP$6),\"\",INDEX(AO:AO,SMALL(AP$2:AP$6,1+ROW(AO4)-ROW(AO$2))))","v":"Unit 5 - Introducing Music Performance"},null,"Unit 5 - Musical Theatre Skills ",{"$f":"IF(COUNTIF(Award!$H$11:$H$12,AS4)>=1,\"\",ROW())","v":4},{"$f":"IF(ROW(AS4)-ROW(AS$2)+1>COUNT(AT$2:AT$6),\"\",INDEX(AS:AS,SMALL(AT$2:AT$6,1+ROW(AS4)-ROW(AS$2))))","v":"Unit 5 - Musical Theatre Skills "},null,"Unit 5 - Training for Personal Fitness",{"$f":"IF(COUNTIF(Award!$H$11:$H$12,AW4)>=1,\"\",ROW())","v":4},{"$f":"IF(ROW(AW4)-ROW(AW$2)+1>COUNT(AX$2:AX$5),\"\",INDEX(AW:AW,SMALL(AX$2:AX$5,1+ROW(AW4)-ROW(AW$2))))","v":""},null,"Unit 5 - Factors Affecting Worldwide Travel and Tourism",{"$f":"IF(COUNTIF(Award!$H$11:$H$12,BA4)>=1,\"\",ROW())","v":4},{"$f":"IF(ROW(BA4)-ROW(BA$2)+1>COUNT(BB$2:BB$5),\"\",INDEX(BA:BA,SMALL(BB$2:BB$5,1+ROW(BA4)-ROW(BA$2))))","v":"Unit 5 - Factors Affecting Worldwide Travel and Tourism"},null,null,null,null,null,"Unit 5 - Health, Fitness and Lifestyle for the Public Services",{"$f":"IF(COUNTIF(Award!$H$11:$H$12,BI4)>=1,\"\",ROW())","v":4},{"$f":"IF(ROW(BI4)-ROW(BI$2)+1>COUNT(BJ$2:BJ$4),\"\",INDEX(BI:BI,SMALL(BJ$2:BJ$4,1+ROW(BI4)-ROW(BI$2))))","v":"Unit 5 - Health, Fitness and Lifestyle for the Public Services"},null,null,null,null,null,"Unit 6 - Creating Digital Graphics",{"$f":"IF(COUNTIF(Award!$H$11:$H$12,BQ4)>=1,\"\",ROW())","v":4},"Unit 6 - Creating Digital Graphics",null,null,null,null,null,null,null,null,null,"Unit 5 - Principles of Animal Behaviour",{"$f":"IF(COUNTIF(Award!$H$11:$H$12,CC4)>=1,\"\",ROW())","v":4},"Unit 5 - Principles of Animal Behaviour"]
["Unit 6 - Investigating Contextual References in Art and Design ",{"$f":"IF(COUNTIF(Award!H11:H12,A5)>=1,\"\",ROW())","v":5},{"$f":"IF(ROW(A5)-ROW(A$2)+1>COUNT(B$2:B$5),\"\",INDEX(A:A,SMALL(B$2:B$5,1+ROW(A5)-ROW(A$2))))","v":"Unit 6 - Investigating Contextual References in Art and Design "},null,"Unit 6 - Introducing Retail Business",{"$f":"IF(COUNTIF(Award!H11:H12,E5)>=1,\"\",ROW())","v":5},"Unit 6 - Introducing Retail Business",null,null,null,null,null,"Unit 7 - Exploring Brickwork and Blockwork Principles and Techniques",{"$f":"IF(COUNTIF(Award!$H$11:$H$12,M5)>=1,\"\",ROW())","v":5},"Unit 7 - Exploring Brickwork and Blockwork Principles and Techniques",null,"Unit 6 - Website Production ",{"$f":"IF(COUNTIF(Award!$H$11:$H$12,Q5)>=1,\"\",ROW())","v":5},{"$f":"IF(ROW(Q5)-ROW(Q$2)+1>COUNT(R$2:R$7),\"\",INDEX(Q:Q,SMALL(R$2:R$7,1+ROW(Q5)-ROW(Q$2))))","v":"Unit 6 - Website Production "},null,"Unit 6 - Computer-aided Engineering",{"$f":"IF(COUNTIF(Award!$H$11:$H$12,U5)>=1,\"\",ROW())","v":5},"Unit 6 - Computer-aided Engineering",null,"Unit 6 - The Impact of Nutrition on Health and Wellbeing ",{"$f":"IF(COUNTIF(Award!$H$11:$H$12,Y5)>=1,\"\",ROW())","v":5},"Unit 6 - The Impact of Nutrition on Health and Wellbeing ",null,"Unit 7 - Food and Beverage Service in the Hospitality Industry",{"$f":"IF(COUNTIF(Award!$H$11:$H$12,AC5)>=1,\"\",ROW())","v":5},{"$f":"IF(ROW(AC5)-ROW(AC$2)+1>COUNT(AD$2:AD$6),\"\",INDEX(AC:AC,SMALL(AD$2:AD$6,1+ROW(AC5)-ROW(AC$2))))","v":"Unit 7 - Food and Beverage Service in the Hospitality Industry"},null,null,null,null,null,"Unit 7 - Creating Digital Video",{"$f":"IF(COUNTIF(Award!$H$11:$H$12,AK5)>=1,\"\",ROW())","v":5},"Unit 7 - Creating Digital Video",null,"Unit 6 - Introducing Music Recording",{"$f":"IF(COUNTIF(Award!$H$11:$H$12,AO5)>=1,\"\",ROW())","v":5},{"$f":"IF(ROW(AO5)-ROW(AO$2)+1>COUNT(AP$2:AP$6),\"\",INDEX(AO:AO,SMALL(AP$2:AP$6,1+ROW(AO5)-ROW(AO$2))))","v":"Unit 6 - Introducing Music Recording"},null,"Unit 6 - Music Performance Skills",{"$f":"IF(COUNTIF(Award!$H$11:$H$12,AS5)>=1,\"\",ROW())","v":5},{"$f":"IF(ROW(AS5)-ROW(AS$2)+1>COUNT(AT$2:AT$6),\"\",INDEX(AS:AS,SMALL(AT$2:AT$6,1+ROW(AS5)-ROW(AS$2))))","v":"Unit 6 - Music Performance Skills"},null,"Unit 6 - Leading Sports Activities",{"$f":"IF(COUNTIF(Award!$H$11:$H$12,AW5)>=1,\"\",ROW())","v":""},{"$f":"IF(ROW(AW5)-ROW(AW$2)+1>COUNT(AX$2:AX$5),\"\",INDEX(AW:AW,SMALL(AX$2:AX$5,1+ROW(AW5)-ROW(AW$2))))","v":""},null,"Unit 6 -The Travel and Tourism Customer Experience ",{"$f":"IF(COUNTIF(Award!$H$11:$H$12,BA5)>=1,\"\",ROW())","v":5},{"$f":"IF(ROW(BA5)-ROW(BA$2)+1>COUNT(BB$2:BB$5),\"\",INDEX(BA:BA,SMALL(BB$2:BB$5,1+ROW(BA5)-ROW(BA$2))))","v":"Unit 6 -The Travel and Tourism Customer Experience "},null,null,null,null,null,null,null,null,null,null,null,null,null,"Unit 7 - Creating Digital Video",{"$f":"IF(COUNTIF(Award!$H$11:$H$12,BQ5)>=1,\"\",ROW())","v":5},"Unit 7 - Creating Digital Video"]
[null,null,null,null,"Unit 7 - Providing Business Support ",{"$f":"IF(COUNTIF(Award!H11:H12,E6)>=1,\"\",ROW())","v":6},"Unit 7 - Providing Business Support ",null,null,null,null,null,"Unit 8 - Exploring Painting and Decorating Principles and Techniques",{"$f":"IF(COUNTIF(Award!$H$11:$H$12,M6)>=1,\"\",ROW())","v":6},"Unit 8 - Exploring Painting and Decorating Principles and Techniques",null,"Unit 7 - Digital Games Production",{"$f":"IF(COUNTIF(Award!$H$11:$H$12,Q6)>=1,\"\",ROW())","v":6},{"$f":"IF(ROW(Q6)-ROW(Q$2)+1>COUNT(R$2:R$6),\"\",INDEX(Q:Q,SMALL(R$2:R$6,1+ROW(Q6)-ROW(Q$2))))","v":"Unit 7 - Digital Games Production"},null,"Unit 7 - Machining Techniques",{"$f":"IF(COUNTIF(Award!$H$11:$H$12,U6)>=1,\"\",ROW())","v":6},"Unit 7 - Machining Techniques",null,"Unit 7 - Equality and Diversity in Health and Social Care ",{"$f":"IF(COUNTIF(Award!$H$11:$H$12,Y6)>=1,\"\",ROW())","v":6},"Unit 7 - Equality and Diversity in Health and Social Care ",null,"Unit 8 - Front Office Services in the Hospitality Industry",{"$f":"IF(COUNTIF(Award!$H$11:$H$12,AC6)>=1,\"\",ROW())","v":6},{"$f":"IF(ROW(AC6)-ROW(AC$2)+1>COUNT(AD$2:AD$6),\"\",INDEX(AC:AC,SMALL(AD$2:AD$6,1+ROW(AC6)-ROW(AC$2))))","v":"Unit 8 - Front Office Services in the Hospitality Industry"},null,null,null,null,null,"Unit 8 - Mobile Apps Development",{"$f":"IF(COUNTIF(Award!$H$11:$H$12,AK6)>=1,\"\",ROW())","v":6},"Unit 8 - Mobile Apps Development",null,"Unit 7 - Introducing Music Sequencing",{"$f":"IF(COUNTIF(Award!$H$11:$H$12,AO6)>=1,\"\",ROW())","v":6},{"$f":"IF(ROW(AO6)-ROW(AO$2)+1>COUNT(AP$2:AP$6),\"\",INDEX(AO:AO,SMALL(AP$2:AP$6,1+ROW(AO6)-ROW(AO$2))))","v":"Unit 7 - Introducing Music Sequencing"},null,"Unit 7 - Production Skills for Performance",{"$f":"IF(COUNTIF(Award!$H$11:$H$12,AS6)>=1,\"\",ROW())","v":6},{"$f":"IF(ROW(AS6)-ROW(AS$2)+1>COUNT(AT$2:AT$6),\"\",INDEX(AS:AS,SMALL(AT$2:AT$6,1+ROW(AS6)-ROW(AS$2))))","v":"Unit 7 - Production Skills for Performance"},null,null,null,null,null,null,null,null,null,null,null,null,null,null,null,null,null,null,null,null,null,"Unit 8 - Mobile Apps Development",{"$f":"IF(COUNTIF(Award!$H$11:$H$12,BQ6)>=1,\"\",ROW())","v":6},"Unit 8 - Mobile Apps Development"]
[null,null,null,null,"Unit 8 - Recruitment, Selection and Employment ",{"$f":"IF(COUNTIF(Award!H11:H12,E7)>=1,\"\",ROW())","v":7},"Unit 8 - Recruitment, Selection and Employment ",null,null,null,null,null,"Unit 9 - Exploring Plumbing Principles and Techniques",{"$f":"IF(COUNTIF(Award!$H$11:$H$12,M7)>=1,\"\",ROW())","v":7},"Unit 9 - Exploring Plumbing Principles and Techniques",null,null,null,null,null,"Unit 8 - Electronic Circuit Design and Construction",{"$f":"IF(COUNTIF(Award!$H$11:$H$12,U7)>=1,\"\",ROW())","v":7},"Unit 8 - Electronic Circuit Design and Construction",null,"Unit 8 - Individual Rights in Health and Social Care",{"$f":"IF(COUNTIF(Award!$H$11:$H$12,Y7)>=1,\"\",ROW())","v":7},"Unit 8 - Individual Rights in Health and Social Care",null,null,null,null,null,null,null,null,null,"Unit 9 - Spreadsheet Development",{"$f":"IF(COUNTIF(Award!$H$11:$H$12,AK7)>=1,\"\",ROW())","v":7},"Unit 9 - Spreadsheet Development",null,null,null,null,null,null,null,null,null,null,null,null,null,null,null,null,null,null,null,null,null,null,null,null,null,null,null,null,null,"Unit 9 - Spreadsheet Development",{"$f":"IF(COUNTIF(Award!$H$11:$H$12,BQ7)>=1,\"\",ROW())","v":7},"Unit 9 - Spreadsheet Development"]
[null,null,null,null,null,null,null,null,null,null,null,null,"Unit 10 - Exploring Electrical Principles and Techniques",{"$f":"IF(COUNTIF(Award!$H$11:$H$12,M8)>=1,\"\",ROW())","v":8},"Unit 10 - Exploring Electrical Principles and Techniques",null,null,null,null,null,null,null,null,null,null,null,null,null,null,null,null,null,null,null,null,null,"Unit 10 - Database Development",{"$f":"IF(COUNTIF(Award!$H$11:$H$12,AK8)>=1,\"\",ROW())","v":8},"Unit 10 - Database Development",null,null,null,null,null,null,null,null,null,null,null,null,null,null,null,null,null,null,null,null,null,null,null,null,null,null,null,null,null,"Unit 10 - Database Development",{"$f":"IF(COUNTIF(Award!$H$11:$H$12,BQ8)>=1,\"\",ROW())","v":8},"Unit 10 - Database Development"]
[null,null,null,null,null,null,null,null,null,null,null,null,null,null,null,null,null,null,null,null,null,null,null,null,null,null,null,null,null,null,null,null,null,null,null,null,"Unit 11 - Computer Networks",{"$f":"IF(COUNTIF(Award!$H$11:$H$12,AK9)>=1,\"\",ROW())","v":9},"Unit 11 - Computer Networks",null,null,null,null,null,null,null,null,null,null,null,null,null,null,null,null,null,null,null,null,null,null,null,null,null,null,null,null,null,"Unit 11 - Computer Networks",{"$f":"IF(COUNTIF(Award!$H$11:$H$12,BQ9)>=1,\"\",ROW())","v":9},"Unit 11 - Computer Networks"]
[null,null,"Animal Care",null,null,null,null,null,null,null,null,null,null,null,null,null,null,null,null,null,null,null,null,null,null,null,null,null,null,null,null,null,null,null,null,null,"Unit 12 - Software Development",{"$f":"IF(COUNTIF(Award!$H$11:$H$12,AK10)>=1,\"\",ROW())","v":10},"Unit 12 - Software Development",null,null,null,null,null,null,null,null,null,null,null,null,null,null,null,null,null,null,null,null,null,null,null,null,null,null,null,null,null,"Unit 12 - Software Development",{"$f":"IF(COUNTIF(Award!$H$11:$H$12,BQ10)>=1,\"\",ROW())","v":10},"Unit 12 - Software Development"]
[null,null,"Application of Science",null,null,null,null,null,null,null,null,null,null,null,null,null,null,null,null,null,null,null,null,null,null,null,null,null,null,null,null,null,null,null,null,null,"Unit 13 - Website Development",{"$f":"IF(COUNTIF(Award!$H$11:$H$12,AK11)>=1,\"\",ROW())","v":11},"Unit 13 - Website Development",null,null,null,null,null,null,null,null,null,null,null,null,null,null,null,null,null,null,null,null,null,null,null,null,null,null,null,null,null,"Unit 13 - Website Development",{"$f":"IF(COUNTIF(Award!$H$11:$H$12,BQ11)>=1,\"\",ROW())","v":11},"Unit 13 - Website Development"]
[null,null,"Art and Design"]
[null,null,"Business"]
[null,null,"CPLD"]
[null,null,"Construction and the Built Environment"]
[null,null,"Creative Digital Media Production"]
[null,null,"Engineering"]
[null,null,"Health and Social Care"]
[null,null,"Hospitality"]
[null,null,"Information and Creative Technology"]
[null,null,"Music"]
[null,null,"Performing Arts"]
[null,null,"Principles of Applied Science"]
[null,null,"Public Services"]
[null,null,"Sport"]
[null,null,"Travel and Tourism"]

{"sheet":"Sheet1","index":4,"n_rows":243,"n_cols":14,"rows_kept":243,"cut":false,"hidden":true,"merged":[]}
["Points","Grade",null,"Points","Grade",null,null,null,null,null,null,null,"Points","Grade"]
[0,"U",null,0,false,null,null,null,null,null,null,null,0,"U"]
[1,"U",null,1,false,null,null,"Sector","Applied Science",null,null,null,1,"U"]
[2,"U",null,2,false,null,null,"Score",null,null,null,null,2,"U"]
[3,"U",null,3,false,null,null,null,null,null,null,null,3,"U"]
[4,"U",null,4,false,null,null,"Grade",{"$f":"IF(I3=\"Applied Science\",VLOOKUP(J15,A2:B99,2,FALSE))","v":"Level 2 Pass"},{"$f":"IF(I6=FALSE,VLOOKUP(I17,A2:B99,2,FALSE),I6)","v":"Level 2 Pass"},null,null,4,"U"]
[5,"U",null,5,false,null,null,null,null,null,null,null,5,"U"]
[6,"U",null,6,false,null,null,null,null,null,null,null,6,"U"]
[7,"U",null,7,false,null,null,"Unit 1",6,null,null,null,7,"U"]
[8,"U",null,8,false,null,null,"Unit 2",12,null,null,null,8,"U"]
[9,"U",null,9,false,null,null,"Unit 3",24,null,null,null,9,"U"]
[10,"U",null,10,false,null,null,"Unit 4",18,null,null,null,10,"U"]
[11,"U",null,11,false,null,null,null,null,"Applied Science",null,null,11,"U"]
[12,"U",null,12,false,null,null,"A",{"$f":"SUM(I9:I10)","v":18},null,null,null,12,"U"]
[13,"U",null,13,false,null,null,"B",{"$f":"SUM(I9:I12)","v":60},{"$f":"SUM(I9:I12)","v":60},null,null,13,"U"]
[14,"U",null,14,false,null,null,null,null,null,null,null,14,"U"]
[15,"U",null,15,false,null,null,null,{"$f":"IF(I14<24,\"Level 1\", I15)","v":"Level 1"},null,null,null,15,"U"]
[16,"U",null,16,false,null,null,null,null,null,null,null,16,"U"]
[17,"U",null,17,false,null,null,null,null,null,null,null,17,"U"]
[18,"U",null,18,false,null,null,null,null,null,null,null,18,"U"]
[19,"U",null,19,false,null,null,null,null,null,null,null,19,"U"]
[20,"U",null,20,false,null,null,null,null,null,null,null,20,"U"]
[21,"U",null,21,false,null,null,null,null,null,null,null,21,"U"]
[22,"U",null,22,false,null,null,null,null,null,null,null,22,"U"]
[23,"U",null,23,false,null,null,null,null,null,null,null,23,"U"]
[24,"Level 1",null,24,true,null,null,null,null,null,null,null,24,"U"]
[25,"Level 1",null,25,true,null,null,null,null,null,null,null,25,"U"]
[26,"Level 1",null,26,true,null,null,null,null,null,null,null,26,"U"]
[27,"Level 1",null,27,true,null,null,null,null,null,null,null,27,"U"]
[28,"Level 1",null,28,true,null,null,null,null,null,null,null,28,"U"]
[29,"Level 1",null,29,true,null,null,null,null,null,null,null,29,"U"]
[30,"Level 1",null,30,true,null,null,null,null,null,null,null,30,"U"]
[31,"Level 1",null,31,true,null,null,null,null,null,null,null,31,"U"]
[32,"Level 1",null,32,true,null,null,null,null,null,null,null,32,"U"]
[33,"Level 1",null,33,true,null,null,null,null,null,null,null,33,"U"]
[34,"Level 1",null,34,true,null,null,null,null,null,null,null,34,"U"]
[35,"Level 1",null,35,true,null,null,null,null,null,null,null,35,"U"]
[36,"Level 1",null,36,true,null,null,null,null,null,null,null,36,"U"]
[37,"Level 1",null,37,true,null,null,null,null,null,null,null,37,"U"]
[38,"Level 1",null,38,true,null,null,null,null,null,null,null,38,"U"]
[39,"Level 1",null,39,true,null,null,null,null,null,null,null,39,"U"]
[40,"Level 1",null,40,true,null,null,null,null,null,null,null,40,"U"]
[41,"Level 1",null,41,true,null,null,null,null,null,null,null,41,"U"]
[42,"Level 1",null,42,true,null,null,null,null,null,null,null,42,"U"]
[43,"Level 1",null,43,true,null,null,null,null,null,null,null,43,"U"]
[44,"Level 1",null,44,true,null,null,null,null,null,null,null,44,"U"]
[45,"Level 1",null,45,true,null,null,null,null,null,null,null,45,"U"]
[46,"Level 1",null,46,true,null,null,null,null,null,null,null,46,"U"]
[47,"Level 1",null,47,true,null,null,null,null,null,null,null,47,"U"]
[48,"Level 2 Pass",null,48,true,null,null,null,null,null,null,null,48,"Level 1"]
[49,"Level 2 Pass",null,null,null,null,null,null,null,null,null,null,49,"Level 1"]
[50,"Level 2 Pass",null,null,null,null,null,null,null,null,null,null,50,"Level 1"]
[51,"Level 2 Pass",null,null,null,null,null,null,null,null,null,null,51,"Level 1"]
[52,"Level 2 Pass",null,null,null,null,null,null,null,null,null,null,52,"Level 1"]
[53,"Level 2 Pass",null,null,null,null,null,null,null,null,null,null,53,"Level 1"]
[54,"Level 2 Pass",null,null,null,null,null,null,null,null,null,null,54,"Level 1"]
[55,"Level 2 Pass",null,null,null,null,null,null,null,null,null,null,55,"Level 1"]
[56,"Level 2 Pass",null,null,null,null,null,null,null,null,null,null,56,"Level 1"]
[57,"Level 2 Pass",null,null,null,null,null,null,null,null,null,null,57,"Level 1"]
[58,"Level 2 Pass",null,null,null,null,null,null,null,null,null,null,58,"Level 1"]
[59,"Level 2 Pass",null,null,null,null,null,null,null,null,null,null,59,"Level 1"]
[60,"Level 2 Pass",null,null,null,null,null,null,null,null,null,null,60,"Level 1"]
[61,"Level 2 Pass",null,null,null,null,null,null,null,null,null,null,61,"Level 1"]
[62,"Level 2 Pass",null,null,null,null,null,null,null,null,null,null,62,"Level 1"]
[63,"Level 2 Pass",null,null,null,null,null,null,null,null,null,null,63,"Level 1"]
[64,"Level 2 Pass",null,null,null,null,null,null,null,null,null,null,64,"Level 1"]
[65,"Level 2 Pass",null,null,null,null,null,null,null,null,null,null,65,"Level 1"]
[66,"Level 2 Merit",null,null,null,null,null,null,null,null,null,null,66,"Level 1"]
[67,"Level 2 Merit",null,null,null,null,null,null,null,null,null,null,67,"Level 1"]
[68,"Level 2 Merit",null,null,null,null,null,null,null,null,null,null,68,"Level 1"]
[69,"Level 2 Merit",null,null,null,null,null,null,null,null,null,null,69,"Level 1"]
[70,"Level 2 Merit",null,null,null,null,null,null,null,null,null,null,70,"Level 1"]
[71,"Level 2 Merit",null,null,null,null,null,null,null,null,null,null,71,"Level 1"]
[72,"Level 2 Merit",null,null,null,null,null,null,null,null,null,null,72,"Level 1"]
[73,"Level 2 Merit",null,null,null,null,null,null,null,null,null,null,73,"Level 1"]
[74,"Level 2 Merit",null,null,null,null,null,null,null,null,null,null,74,"Level 1"]
[75,"Level 2 Merit",null,null,null,null,null,null,null,null,null,null,75,"Level 1"]
[76,"Level 2 Merit",null,null,null,null,null,null,null,null,null,null,76,"Level 1"]
[77,"Level 2 Merit",null,null,null,null,null,null,null,null,null,null,77,"Level 1"]
[78,"Level 2 Merit",null,null,null,null,null,null,null,null,null,null,78,"Level 1"]
[79,"Level 2 Merit",null,null,null,null,null,null,null,null,null,null,79,"Level 1"]
[80,"Level 2 Merit",null,null,null,null,null,null,null,null,null,null,80,"Level 1"]
[81,"Level 2 Merit",null,null,null,null,null,null,null,null,null,null,81,"Level 1"]
[82,"Level 2 Merit",null,null,null,null,null,null,null,null,null,null,82,"Level 1"]
[83,"Level 2 Merit",null,null,null,null,null,null,null,null,null,null,83,"Level 1"]
[84,"Level 2 Distinction",null,null,null,null,null,null,null,null,null,null,84,"Level 1"]
[85,"Level 2 Distinction",null,null,null,null,null,null,null,null,null,null,85,"Level 1"]
[86,"Level 2 Distinction",null,null,null,null,null,null,null,null,null,null,86,"Level 1"]
[87,"Level 2 Distinction",null,null,null,null,null,null,null,null,null,null,87,"Level 1"]
[88,"Level 2 Distinction",null,null,null,null,null,null,null,null,null,null,88,"Level 1"]
[89,"Level 2 Distinction",null,null,null,null,null,null,null,null,null,null,89,"Level 1"]
[90,"Level 2 Distinction*",null,null,null,null,null,null,null,null,null,null,90,"Level 1"]
[91,"Level 2 Distinction*",null,null,null,null,null,null,null,null,null,null,91,"Level 1"]
[92,"Level 2 Distinction*",null,null,null,null,null,null,null,null,null,null,92,"Level 1"]
[93,"Level 2 Distinction*",null,null,null,null,null,null,null,null,null,null,93,"Level 1"]
[94,"Level 2 Distinction*",null,null,null,null,null,null,null,null,null,null,94,"Level 1"]
[95,"Level 2 Distinction*",null,null,null,null,null,null,null,null,null,null,95,"Level 1"]
[96,"Level 2 Distinction*",null,null,null,null,null,null,null,null,null,null,96,"Level 2 PP"]
["Level 1","Level 1",null,null,null,null,null,null,null,null,null,null,97,"Level 2 PP"]
[null,null,null,null,null,null,null,null,null,null,null,null,98,"Level 2 PP"]
[null,null,null,null,null,null,null,null,null,null,null,null,99,"Level 2 PP"]
[null,null,null,null,null,null,null,null,null,null,null,null,100,"Level 2 PP"]
[null,null,null,null,null,null,null,null,null,null,null,null,101,"Level 2 PP"]
[null,null,null,null,null,null,null,null,null,null,null,null,102,"Level 2 PP"]
[null,null,null,null,null,null,null,null,null,null,null,null,103,"Level 2 PP"]
[null,null,null,null,null,null,null,null,null,null,null,null,104,"Level 2 PP"]
[null,null,null,null,null,null,null,null,null,null,null,null,105,"Level 2 PP"]
[null,null,null,null,null,null,null,null,null,null,null,null,106,"Level 2 PP"]
[null,null,null,null,null,null,null,null,null,null,null,null,107,"Level 2 PP"]
[null,null,null,null,null,null,null,null,null,null,null,null,108,"Level 2 PP"]
[null,null,null,null,null,null,null,null,null,null,null,null,109,"Level 2 PP"]
[null,null,null,null,null,null,null,null,null,null,null,null,110,"Level 2 PP"]
[null,null,null,null,null,null,null,null,null,null,null,null,111,"Level 2 PP"]
[null,null,null,null,null,null,null,null,null,null,null,null,112,"Level 2 PP"]
[null,null,null,null,null,null,null,null,null,null,null,null,113,"Level 2 PP"]
[null,null,null,null,null,null,null,null,null,null,null,null,114,"Level 2 MP"]
[null,null,null,null,null,null,null,null,null,null,null,null,115,"Level 2 MP"]
[null,null,null,null,null,null,null,null,null,null,null,null,116,"Level 2 MP"]
[null,null,null,null,null,null,null,null,null,null,null,null,117,"Level 2 MP"]
[null,null,null,null,null,null,null,null,null,null,null,null,118,"Level 2 MP"]
[null,null,null,null,null,null,null,null,null,null,null,null,119,"Level 2 MP"]
[null,null,null,null,null,null,null,null,null,null,null,null,120,"Level 2 MP"]
[null,null,null,null,null,null,null,null,null,null,null,null,121,"Level 2 MP"]
[null,null,null,null,null,null,null,null,null,null,null,null,122,"Level 2 MP"]
[null,null,null,null,null,null,null,null,null,null,null,null,123,"Level 2 MP"]
[null,null,null,null,null,null,null,null,null,null,null,null,124,"Level 2 MP"]
[null,null,null,null,null,null,null,null,null,null,null,null,125,"Level 2 MP"]
[null,null,null,null,null,null,null,null,null,null,null,null,126,"Level 2 MP"]
[null,null,null,null,null,null,null,null,null,null,null,null,127,"Level 2 MP"]
[null,null,null,null,null,null,null,null,null,null,null,null,128,"Level 2 MP"]
[null,null,null,null,null,null,null,null,null,null,null,null,129,"Level 2 MP"]
[null,null,null,null,null,null,null,null,null,null,null,null,130,"Level 2 MP"]
[null,null,null,null,null,null,null,null,null,null,null,null,131,"Level 2 MP"]
[null,null,null,null,null,null,null,null,null,null,null,null,132,"Level 2 MM"]
[null,null,null,null,null,null,null,null,null,null,null,null,133,"Level 2 MM"]
[null,null,null,null,null,null,null,null,null,null,null,null,134,"Level 2 MM"]
[null,null,null,null,null,null,null,null,null,null,null,null,135,"Level 2 MM"]
[null,null,null,null,null,null,null,null,null,null,null,null,136,"Level 2 MM"]
[null,null,null,null,null,null,null,null,null,null,null,null,137,"Level 2 MM"]
[null,null,null,null,null,null,null,null,null,null,null,null,138,"Level 2 MM"]
[null,null,null,null,null,null,null,null,null,null,null,null,139,"Level 2 MM"]
[null,null,null,null,null,null,null,null,null,null,null,null,140,"Level 2 MM"]
[null,null,null,null,null,null,null,null,null,null,null,null,141,"Level 2 MM"]
[null,null,null,null,null,null,null,null,null,null,null,null,142,"Level 2 MM"]
[null,null,null,null,null,null,null,null,null,null,null,null,143,"Level 2 MM"]
[null,null,null,null,null,null,null,null,null,null,null,null,144,"Level 2 MM"]
[null,null,null,null,null,null,null,null,null,null,null,null,145,"Level 2 MM"]
[null,null,null,null,null,null,null,null,null,null,null,null,146,"Level 2 MM"]
[null,null,null,null,null,null,null,null,null,null,null,null,147,"Level 2 MM"]
[null,null,null,null,null,null,null,null,null,null,null,null,148,"Level 2 MM"]
[null,null,null,null,null,null,null,null,null,null,null,null,149,"Level 2 MM"]
[null,null,null,null,null,null,null,null,null,null,null,null,150,"Level 2 DM"]
[null,null,null,null,null,null,null,null,null,null,null,null,151,"Level 2 DM"]
[null,null,null,null,null,null,null,null,null,null,null,null,152,"Level 2 DM"]
[null,null,null,null,null,null,null,null,null,null,null,null,153,"Level 2 DM"]
[null,null,null,null,null,null,null,null,null,null,null,null,154,"Level 2 DM"]
[null,null,null,null,null,null,null,null,null,null,null,null,155,"Level 2 DM"]
[null,null,null,null,null,null,null,null,null,null,null,null,156,"Level 2 DM"]
[null,null,null,null,null,null,null,null,null,null,null,null,157,"Level 2 DM"]
[null,null,null,null,null,null,null,null,null,null,null,null,158,"Level 2 DM"]
[null,null,null,null,null,null,null,null,null,null,null,null,159,"Level 2 DM"]
[null,null,null,null,null,null,null,null,null,null,null,null,160,"Level 2 DM"]
[null,null,null,null,null,null,null,null,null,null,null,null,161,"Level 2 DM"]
[null,null,null,null,null,null,null,null,null,null,null,null,162,"Level 2 DM"]
[null,null,null,null,null,null,null,null,null,null,null,null,163,"Level 2 DM"]
[null,null,null,null,null,null,null,null,null,null,null,null,164,"Level 2 DM"]
[null,null,null,null,null,null,null,null,null,null,null,null,165,"Level 2 DM"]
[null,null,null,null,null,null,null,null,null,null,null,null,166,"Level 2 DM"]
[null,null,null,null,null,null,null,null,null,null,null,null,167,"Level 2 DM"]
[null,null,null,null,null,null,null,null,null,null,null,null,168,"Level 2 DD"]
[null,null,null,null,null,null,null,null,null,null,null,null,169,"Level 2 DD"]
[null,null,null,null,null,null,null,null,null,null,null,null,170,"Level 2 DD"]
[null,null,null,null,null,null,null,null,null,null,null,null,171,"Level 2 DD"]
[null,null,null,null,null,null,null,null,null,null,null,null,172,"Level 2 DD"]
[null,null,null,null,null,null,null,null,null,null,null,null,173,"Level 2 DD"]
[null,null,null,null,null,null,null,null,null,null,null,null,174,"Level 2 D*D"]
[null,null,null,null,null,null,null,null,null,null,null,null,175,"Level 2 D*D"]
[null,null,null,null,null,null,null,null,null,null,null,null,176,"Level 2 D*D"]
[null,null,null,null,null,null,null,null,null,null,null,null,177,"Level 2 D*D"]
[null,null,null,null,null,null,null,null,null,null,null,null,178,"Level 2 D*D"]
[null,null,null,null,null,null,null,null,null,null,null,null,179,"Level 2 D*D"]
[null,null,null,null,null,null,null,null,null,null,null,null,180,"Level 2 D*D*"]
[null,null,null,null,null,null,null,null,null,null,null,null,181,"Level 2 D*D*"]
[null,null,null,null,null,null,null,null,null,null,null,null,182,"Level 2 D*D*"]
[null,null,null,null,null,null,null,null,null,null,null,null,183,"Level 2 D*D*"]
[null,null,null,null,null,null,null,null,null,null,null,null,184,"Level 2 D*D*"]
[null,null,null,null,null,null,null,null,null,null,null,null,185,"Level 2 D*D*"]
[null,null,null,null,null,null,null,null,null,null,null,null,186,"Level 2 D*D*"]
[null,null,null,null,null,null,null,null,null,null,null,null,187,"Level 2 D*D*"]
[null,null,null,null,null,null,null,null,null,null,null,null,188,"Level 2 D*D*"]
[null,null,null,null,null,null,null,null,null,null,null,null,189,"Level 2 D*D*"]
[null,null,null,null,null,null,null,null,null,null,null,null,190,"Level 2 D*D*"]
[null,null,null,null,null,null,null,null,null,null,null,null,191,"Level 2 D*D*"]
[null,null,null,null,null,null,null,null,null,null,null,null,192,"Level 2 D*D*"]
[null,null,null,null,null,null,null,null,null,null,null,null,193,"Level 2 D*D*"]
[null,null,null,null,null,null,null,null,null,null,null,null,194,"Level 2 D*D*"]
[null,null,null,null,null,null,null,null,null,null,null,null,195,"Level 2 D*D*"]
[null,null,null,null,null,null,null,null,null,null,null,null,196,"Level 2 D*D*"]
[null,null,null,null,null,null,null,null,null,null,null,null,197,"Level 2 D*D*"]
[null,null,null,null,null,null,null,null,null,null,null,null,198,"Level 2 D*D*"]
[null,null,null,null,null,null,null,null,null,null,null,null,199]
[null,null,null,null,null,null,null,null,null,null,null,null,200]
[null,null,null,null,null,null,null,null,null,null,null,null,201]
[null,null,null,null,null,null,null,null,null,null,null,null,202]
[null,null,null,null,null,null,null,null,null,null,null,null,203]
[null,null,null,null,null,null,null,null,null,null,null,null,204]
[null,null,null,null,null,null,null,null,null,null,null,null,205]
[null,null,null,null,null,null,null,null,null,null,null,null,206]
[null,null,null,null,null,null,null,null,null,null,null,null,207]
[null,null,null,null,null,null,null,null,null,null,null,null,208]
[null,null,null,null,null,null,null,null,null,null,null,null,209]
[null,null,null,null,null,null,null,null,null,null,null,null,210]
[null,null,null,null,null,null,null,null,null,null,null,null,211]
[null,null,null,null,null,null,null,null,null,null,null,null,212]
[null,null,null,null,null,null,null,null,null,null,null,null,213]
[null,null,null,null,null,null,null,null,null,null,null,null,214]
[null,null,null,null,null,null,null,null,null,null,null,null,215]
[null,null,null,null,null,null,null,null,null,null,null,null,216]
[null,null,null,null,null,null,null,null,null,null,null,null,217]
[null,null,null,null,null,null,null,null,null,null,null,null,218]
[null,null,null,null,null,null,null,null,null,null,null,null,219]
[null,null,null,null,null,null,null,null,null,null,null,null,220]
[null,null,null,null,null,null,null,null,null,null,null,null,221]
[null,null,null,null,null,null,null,null,null,null,null,null,222]
[null,null,null,null,null,null,null,null,null,null,null,null,223]
[null,null,null,null,null,null,null,null,null,null,null,null,224]
[null,null,null,null,null,null,null,null,null,null,null,null,225]
[null,null,null,null,null,null,null,null,null,null,null,null,226]
[null,null,null,null,null,null,null,null,null,null,null,null,227]
[null,null,null,null,null,null,null,null,null,null,null,null,228]
[null,null,null,null,null,null,null,null,null,null,null,null,229]
[null,null,null,null,null,null,null,null,null,null,null,null,230]
[null,null,null,null,null,null,null,null,null,null,null,null,231]
[null,null,null,null,null,null,null,null,null,null,null,null,232]
[null,null,null,null,null,null,null,null,null,null,null,null,233]
[null,null,null,null,null,null,null,null,null,null,null,null,234]
[null,null,null,null,null,null,null,null,null,null,null,null,235]
[null,null,null,null,null,null,null,null,null,null,null,null,236]
[null,null,null,null,null,null,null,null,null,null,null,null,237]
[null,null,null,null,null,null,null,null,null,null,null,null,238]
[null,null,null,null,null,null,null,null,null,null,null,null,239]
[null,null,null,null,null,null,null,null,null,null,null,null,240]
[null,null,null,null,null,null,null,null,null,null,null,null,241]

{"sheet":"Certificate","index":5,"n_rows":63,"n_cols":46,"rows_kept":63,"cut":false,"hidden":false,"merged":[[8,18,9,18],[28,12,29,12]]}
[]
[null,null,null,null,null,null,"Certificate"]
[]
[]
[null,null,null,null,"Start ->","Select Sector"]
[]
[null,null,null,null,null,null,null,"    Certificate - 240 GLH"]
[null,null,null,null,null,"Type","Unit","GLH","Grade",null,"Points",null,null,"ICT",null,null,null,null,null,null,null,null,null,null,null,null,null,null,null,null,null,null,null,null,null,null,null,null,null,null,null,null,null,null,null,30]
[null,null,null,null,"Core",{"$f":"IF(ISERROR(VLOOKUP(G9,'Cert Unit Data'!B3:D25,3,FALSE)),\"\",VLOOKUP(G9,'Cert Unit Data'!B3:D25,3,FALSE))","v":""},{"$f":"IF(ISERROR(VLOOKUP(G5,'Cert Unit Data'!A3:B25,2,FALSE)),\"\",VLOOKUP(G5,'Cert Unit Data'!A3:B25,2,FALSE))","v":""},{"$f":"IF(ISERROR(VLOOKUP(G9,'Cert Unit Data'!B3:D25,2,FALSE)),\"\",VLOOKUP(G9,'Cert Unit Data'!B3:D25,2,FALSE))","v":""},null,{"$f":"IF(I9=\"U\",0,IF(I9=\"L1\",2,IF(I9=\"P\",4,IF(I9=\"M\",6,IF(I9=\"D\",8)))))","v":false},{"$f":"IF(ISERROR(IF(I9=\"\",\"\",J9*(H9/10))),\"\",IF(I9=\"\",\"\",J9*(H9/10)))","v":""},null,{"$f":"K9+K10","v":{"$error":"#VALUE!"}},{"$f":"IF(K9>K10,K9,K10)","v":""},null,null,null,null,null,null,null,null,null,null,null,{"$f":"K9+K10","v":{"$error":"#VALUE!"}},{"$f":"IF(K29<48,\"U\",IF(AND(K29>47,K29<96),\"Level 1\",IF(AND(K29>95,K29<114,Z9>23),\"Level 2 PP\",IF(AND(K29>113,K29<132,Z9>23),\"Level 2 MP\",IF(AND(K29>131,K29<150,Z9>23),\"Level 2 MM\",IF(AND(K29>149,K29<168,Z9>23),\"Level 2 DM\",IF(AND(K29>167,K29<200,Z9>23),Second)))))))","v":"U"},null,null,null,null,null,null,null,null,null,null,null,null,null,null,null,null,null,null,60]
[null,null,null,null,null,{"$f":"IF(ISERROR(VLOOKUP(G10,'Cert Unit Data'!G3:I25,3,FALSE)),\"\",VLOOKUP(G10,'Cert Unit Data'!G3:I25,3,FALSE))","v":""},{"$f":"IF(ISERROR(VLOOKUP(G5,'Cert Unit Data'!F3:G25,2,FALSE)),\"\",VLOOKUP(G5,'Cert Unit Data'!F3:G25,2,FALSE))","v":""},{"$f":"IF(ISERROR(VLOOKUP(G10,'Cert Unit Data'!G3:I25,2,FALSE)),\"\",VLOOKUP(G10,'Cert Unit Data'!G3:I25,2,FALSE))","v":""},null,{"$f":"IF(I10=\"U\",0,IF(I10=\"L1\",2,IF(I10=\"P\",4,IF(I10=\"M\",6,IF(I10=\"D\",8)))))","v":false},{"$f":"IF(ISERROR(IF(I10=\"\",\"\",J10*(H10/10))),\"\",IF(I10=\"\",\"\",J10*(H10/10)))","v":""},null,{"$f":"SUM(K9:K10,K12:K15,K17:K21,K23:K26)","v":0},{"$f":"N9+K12","v":{"$error":"#VALUE!"}},null,null,null,null,null,null,null,null,null,null,null,null,{"$f":"IF(AND(K29>167,K29<174,Z9>23),\"Level 2 DD\",IF(AND(K29>173,K29<180,Z9>23),\"Level 2 D*D\",IF(AND(K29>179,Z9>23),\"Level 2 D*D*\")))","v":{"$error":"#VALUE!"}}]
[null,null,null,null,null,null,null,null,null,null,null,null,{"$f":"IF(AND(M9<12),\"U\",IF(AND(M9<24,M9>11,M10<47),\"U\",IF(AND(M9<24,M9>11,M10>47),\"Level 1\",IF(AND(M9>23),M10))))","v":{"$error":"#VALUE!"}},{"$f":"IF(AND(N10<12),\"U\",IF(AND(N10<24,N10>11,M10>47),\"Level 1\",IF(AND(N10<24,N10>11,M10<47),\"U\",IF(AND(N10>23),M10))))","v":{"$error":"#VALUE!"}}]
[null,null,null,null,{"$f":"IF(G5=\"Information and Creative Technology\",\"Core\",\"Mandatory\")","v":"Mandatory"},{"$f":"IF(ISERROR(VLOOKUP(G12,'Cert Unit Data'!L3:N25,3,FALSE)),\"\",VLOOKUP(G12,'Cert Unit Data'!L3:N25,3,FALSE))","v":""},{"$f":"IF(ISERROR(VLOOKUP(G5,'Cert Unit Data'!K3:L25,2,FALSE)),\"\",VLOOKUP(G5,'Cert Unit Data'!K3:L25,2,FALSE))","v":""},{"$f":"IF(ISERROR(VLOOKUP(G12,'Cert Unit Data'!L3:N25,2,FALSE)),\"\",VLOOKUP(G12,'Cert Unit Data'!L3:N25,2,FALSE))","v":""},null,{"$f":"IF(I12=\"U\",0,IF(I12=\"L1\",2,IF(I12=\"P\",4,IF(I12=\"M\",6,IF(I12=\"D\",8)))))","v":false},{"$f":"IF(ISERROR(IF(I12=\"\",\"\",J12*(H12/10))),\"\",IF(I12=\"\",\"\",J12*(H12/10)))","v":""},null,{"$f":"IF(ISERROR(IF(M11=\"U\",\"U\",IF(M11=\"Level 1\",\"Level 1\",VLOOKUP(M11,'Sheet1 (2)'!A2:B194,2,FALSE)))),\"\",IF(M11=\"U\",\"U\",IF(M11=\"Level 1\",\"Level 1\",VLOOKUP(M11,'Sheet1 (2)'!A2:B194,2,FALSE))))","v":""},{"$f":"IF(ISERROR(IF(N11=\"U\",\"U\",IF(N11=\"Level 1\",\"Level 1\",VLOOKUP(N11,'Sheet1 (2)'!A2:B194,2,FALSE)))),\"\",IF(N11=\"U\",\"U\",IF(N11=\"Level 1\",\"Level 1\",VLOOKUP(N11,'Sheet1 (2)'!A2:B194,2,FALSE))))","v":""}]
[null,null,null,null,null,{"$f":"IF(ISERROR(VLOOKUP(G13,'Cert Unit Data'!L30:N51,3,FALSE)),\"\",VLOOKUP(G13,'Cert Unit Data'!L30:N51,3,FALSE))","v":""},{"$f":"IF(ISERROR(VLOOKUP(G5,'Cert Unit Data'!K30:L51,2,FALSE)),\"\",VLOOKUP(G5,'Cert Unit Data'!K30:L51,2,FALSE))","v":""},{"$f":"IF(ISERROR(VLOOKUP(G13,'Cert Unit Data'!L30:N51,2,FALSE)),\"\",VLOOKUP(G13,'Cert Unit Data'!L30:N51,2,FALSE))","v":""},null,{"$f":"IF(I13=\"U\",0,IF(I13=\"L1\",2,IF(I13=\"P\",4,IF(I13=\"M\",6,IF(I13=\"D\",8)))))","v":false},{"$f":"IF(ISERROR(IF(I13=\"\",\"\",J13*(H13/10))),\"\",IF(I13=\"\",\"\",J13*(H13/10)))","v":""}]
[null,null,null,null,null,{"$f":"IF(ISERROR(VLOOKUP(G14,'Cert Unit Data'!L53:N75,3,FALSE)),\"\",VLOOKUP(G14,'Cert Unit Data'!L53:N75,3,FALSE))","v":""},{"$f":"IF(ISERROR(VLOOKUP(G5,'Cert Unit Data'!K53:L74,2,FALSE)),\"\",VLOOKUP(G5,'Cert Unit Data'!K52:L74,2,FALSE))","v":""},{"$f":"IF(ISERROR(VLOOKUP(G14,'Cert Unit Data'!L53:N75,2,FALSE)),\"\",VLOOKUP(G14,'Cert Unit Data'!L53:N75,2,FALSE))","v":""},null,{"$f":"IF(I14=\"U\",0,IF(I14=\"L1\",2,IF(I14=\"P\",4,IF(I14=\"M\",6,IF(I14=\"D\",8)))))","v":false},{"$f":"IF(ISERROR(IF(I14=\"\",\"\",J14*(H14/10))),\"\",IF(I14=\"\",\"\",J14*(H14/10)))","v":""}]
[null,null,null,null,null,{"$f":"IF(ISERROR(VLOOKUP(G15,'Cert Unit Data'!L80:N102,3,FALSE)),\"\",VLOOKUP(G15,'Cert Unit Data'!L80:N102,3,FALSE))","v":""},{"$f":"IF(ISERROR(VLOOKUP(G5,'Cert Unit Data'!K80:L102,2,FALSE)),\"\",VLOOKUP(G5,'Cert Unit Data'!K80:L102,2,FALSE))","v":""},{"$f":"IF(ISERROR(VLOOKUP(G15,'Cert Unit Data'!L80:N102,2,FALSE)),\"\",VLOOKUP(G15,'Cert Unit Data'!L80:N102,2,FALSE))","v":""},null,{"$f":"IF(I15=\"U\",0,IF(I15=\"L1\",2,IF(I15=\"P\",4,IF(I15=\"M\",6,IF(I15=\"D\",8)))))","v":false},{"$f":"IF(ISERROR(IF(I15=\"\",\"\",J15*(H15/10))),\"\",IF(I15=\"\",\"\",J15*(H15/10)))","v":""}]
[]
[null,null,null,null,{"$f":"IF(OR(G5=\"Creative Digital Media Production\",G5=\"Hospitality\",G5=\"Music\",G5=\"Performing Arts Acting\",G5=\"Performing Arts Dance\",G5=\"Performing Arts Musical Theatre\",G5=\"Performing Arts Production\",G5=\"\"),\"Optional A\",\"Optional\")","v":"Optional A"},{"$f":"IF(ISERROR(VLOOKUP(G17,'Cert Unit Data'!$Q$3:$S$157,3,FALSE)),\"\",VLOOKUP(G17,'Cert Unit Data'!$Q$3:$S$157,3,FALSE))","v":""},null,{"$f":"IF(ISERROR(VLOOKUP(G17,'Cert Unit Data'!$Q$3:$S$157,2,FALSE)),\"\",VLOOKUP(G17,'Cert Unit Data'!$Q$3:$S$157,2,FALSE))","v":""},null,{"$f":"IF(I17=\"U\",0,IF(I17=\"L1\",2,IF(I17=\"P\",4,IF(I17=\"M\",6,IF(I17=\"D\",8)))))","v":false},{"$f":"IF(ISERROR(IF(I17=\"\",\"\",J17*(H17/10))),\"\",IF(I17=\"\",\"\",J17*(H17/10)))","v":""}]
[null,null,null,null,null,{"$f":"IF(ISERROR(VLOOKUP(G18,'Cert Unit Data'!$Q$3:$S$157,3,FALSE)),\"\",VLOOKUP(G18,'Cert Unit Data'!$Q$3:$S$157,3,FALSE))","v":""},null,{"$f":"IF(ISERROR(VLOOKUP(G18,'Cert Unit Data'!$Q$3:$S$157,2,FALSE)),\"\",VLOOKUP(G18,'Cert Unit Data'!$Q$3:$S$157,2,FALSE))","v":""},null,{"$f":"IF(I18=\"U\",0,IF(I18=\"L1\",2,IF(I18=\"P\",4,IF(I18=\"M\",6,IF(I18=\"D\",8)))))","v":false},{"$f":"IF(ISERROR(IF(I18=\"\",\"\",J18*(H18/10))),\"\",IF(I18=\"\",\"\",J18*(H18/10)))","v":""},null,{"$f":"IF(G39<>\"\",2,1)","v":1}]
[null,null,null,null,null,{"$f":"IF(ISERROR(VLOOKUP(G19,'Cert Unit Data'!$Q$3:$S$157,3,FALSE)),\"\",VLOOKUP(G19,'Cert Unit Data'!$Q$3:$S$157,3,FALSE))","v":""},null,{"$f":"IF(ISERROR(VLOOKUP(G19,'Cert Unit Data'!$Q$3:$S$157,2,FALSE)),\"\",VLOOKUP(G19,'Cert Unit Data'!$Q$3:$S$157,2,FALSE))","v":""},null,{"$f":"IF(I19=\"U\",0,IF(I19=\"L1\",2,IF(I19=\"P\",4,IF(I19=\"M\",6,IF(I19=\"D\",8)))))","v":false},{"$f":"IF(ISERROR(IF(I19=\"\",\"\",J19*(H19/10))),\"\",IF(I19=\"\",\"\",J19*(H19/10)))","v":""}]
[null,null,null,null,null,{"$f":"IF(ISERROR(VLOOKUP(G20,'Cert Unit Data'!$Q$3:$S$157,3,FALSE)),\"\",VLOOKUP(G20,'Cert Unit Data'!$Q$3:$S$157,3,FALSE))","v":""},null,{"$f":"IF(ISERROR(VLOOKUP(G20,'Cert Unit Data'!$Q$3:$S$157,2,FALSE)),\"\",VLOOKUP(G20,'Cert Unit Data'!$Q$3:$S$157,2,FALSE))","v":""},null,{"$f":"IF(I20=\"U\",0,IF(I20=\"L1\",2,IF(I20=\"P\",4,IF(I20=\"M\",6,IF(I20=\"D\",8)))))","v":false},{"$f":"IF(ISERROR(IF(I20=\"\",\"\",J20*(H20/10))),\"\",IF(I20=\"\",\"\",J20*(H20/10)))","v":""}]
[null,null,null,null,null,{"$f":"IF(ISERROR(VLOOKUP(G21,'Cert Unit Data'!$Q$3:$S$157,3,FALSE)),\"\",VLOOKUP(G21,'Cert Unit Data'!$Q$3:$S$157,3,FALSE))","v":""},null,{"$f":"IF(ISERROR(VLOOKUP(G21,'Cert Unit Data'!$Q$3:$S$157,2,FALSE)),\"\",VLOOKUP(G21,'Cert Unit Data'!$Q$3:$S$157,2,FALSE))","v":""},null,{"$f":"IF(I21=\"U\",0,IF(I21=\"L1\",2,IF(I21=\"P\",4,IF(I21=\"M\",6,IF(I21=\"D\",8)))))","v":false},{"$f":"IF(ISERROR(IF(I21=\"\",\"\",J21*(H21/10))),\"\",IF(I21=\"\",\"\",J21*(H21/10)))","v":""}]
[]
[null,null,null,null,"Optional B",{"$f":"IF(ISERROR(VLOOKUP(G23,'Cert Unit Data'!$Q$3:$S$157,3,FALSE)),\"\",VLOOKUP(G23,'Cert Unit Data'!$Q$3:$S$157,3,FALSE))","v":""},null,{"$f":"IF(ISERROR(VLOOKUP(G23,'Cert Unit Data'!$Q$3:$S$157,2,FALSE)),\"\",VLOOKUP(G23,'Cert Unit Data'!$Q$3:$S$157,2,FALSE))","v":""},null,{"$f":"IF(I23=\"U\",0,IF(I23=\"L1\",2,IF(I23=\"P\",4,IF(I23=\"M\",6,IF(I23=\"D\",8)))))","v":false},{"$f":"IF(ISERROR(IF(I23=\"\",\"\",J23*(H23/10))),\"\",IF(I23=\"\",\"\",J23*(H23/10)))","v":""}]
[null,null,null,null,null,{"$f":"IF(ISERROR(VLOOKUP(G24,'Cert Unit Data'!$Q$3:$S$157,3,FALSE)),\"\",VLOOKUP(G24,'Cert Unit Data'!$Q$3:$S$157,3,FALSE))","v":""},null,{"$f":"IF(ISERROR(VLOOKUP(G24,'Cert Unit Data'!$Q$3:$S$157,2,FALSE)),\"\",VLOOKUP(G24,'Cert Unit Data'!$Q$3:$S$157,2,FALSE))","v":""},null,{"$f":"IF(I24=\"U\",0,IF(I24=\"L1\",2,IF(I24=\"P\",4,IF(I24=\"M\",6,IF(I24=\"D\",8)))))","v":false},{"$f":"IF(ISERROR(IF(I24=\"\",\"\",J24*(H24/10))),\"\",IF(I24=\"\",\"\",J24*(H24/10)))","v":""}]
[null,null,null,null,null,{"$f":"IF(ISERROR(VLOOKUP(G25,'Cert Unit Data'!$Q$3:$S$157,3,FALSE)),\"\",VLOOKUP(G25,'Cert Unit Data'!$Q$3:$S$157,3,FALSE))","v":""},null,{"$f":"IF(ISERROR(VLOOKUP(G25,'Cert Unit Data'!$Q$3:$S$157,2,FALSE)),\"\",VLOOKUP(G25,'Cert Unit Data'!$Q$3:$S$157,2,FALSE))","v":""},null,{"$f":"IF(I25=\"U\",0,IF(I25=\"L1\",2,IF(I25=\"P\",4,IF(I25=\"M\",6,IF(I25=\"D\",8)))))","v":false},{"$f":"IF(ISERROR(J25*(H25/10)),\"\",J25*(H25/10))","v":""}]
[null,null,null,null,null,{"$f":"IF(ISERROR(VLOOKUP(G26,[3]Sheet3!$Q$3:$S$148,3,FALSE)),\"\",VLOOKUP(G26,[3]Sheet3!$Q$3:$S$148,3,FALSE))","v":""},null,{"$f":"IF(ISERROR(VLOOKUP(G26,[3]Sheet3!$Q$3:$S$148,2,FALSE)),\"\",VLOOKUP(G26,[3]Sheet3!$Q$3:$S$148,2,FALSE))","v":""},null,{"$f":"IF(I26=\"U\",0,IF(I26=\"L1\",2,IF(I26=\"P\",4,IF(I26=\"M\",6,IF(I26=\"D\",8)))))","v":false},{"$f":"IF(ISERROR(J26*(H26/10)),\"\",J26*(H26/10))","v":""}]
[null,null,null,null,null,null,null,{"$f":"SUM(H9:H26)","v":0}]
[]
[null,null,null,null,null,null,null,null," Points",null,{"$f":"SUM(K9:K23)","v":0},null,{"$f":"IF(ISERROR(IF($G$5=\"Application of Science\", \"\", IF($K9+$K10<24,\"24 points across Core Units required to achieve Level 2\",\"\"))),\"\",IF($G$5=\"Application of Science\", \"\", IF($K9+$K10<24,\"24 points across Core Units required to achieve Level 2\",\"\")))","v":""}]
[null,null,null,null,null,null,null,null," Grade",null,{"$f":"IF(G5=\"\",\"\",IF(G5=\"Information and Creative Technology\",N12,M12))","v":""},{"$f":"IF(H27>240,1,IF(H27<240,3,2))","v":3}]
[]
[]
[null,null,null,null,null,"Unit Type","Requirements"]
[null,null,null,null,null,"Core",{"$f":"IF(ISERROR(VLOOKUP(G5,[3]Sheet1!D3:E24,2,FALSE)),\"\",VLOOKUP(G5,[3]Sheet1!D3:E24,2,FALSE))","v":""}]
[null,null,null,null,null,"Mandatory",{"$f":"IF(ISERROR(VLOOKUP(G5,[3]Sheet1!D27:E48,2,FALSE)),\"\",VLOOKUP(G5,[3]Sheet1!D27:E48,2,FALSE))","v":""}]
[null,"Art and Design",null,null,null,"Optional A",{"$f":"IF(ISERROR(VLOOKUP(G5,[3]Sheet1!D51:E72,2,FALSE)),\"\",VLOOKUP(G5,[3]Sheet1!D51:E72,2,FALSE))","v":""}]
[null,"Art and Design Design Crafts",null,null,null,"Optional B",{"$f":"IF(ISERROR(VLOOKUP(G5,[3]Sheet1!D75:E96,2,FALSE)),\"\",VLOOKUP(G5,[3]Sheet1!D75:E96,2,FALSE))","v":""}]
[null,"Art and Design Fashion and Textiles"]
[null,"Art and Design Photography",null,null,null,"Issues",{"$f":"IF(ISERROR(IF(AND(G23=\"\",G24=\"\",G25=\"\"),VLOOKUP(G5,[3]Sheet1!D98:E104,2,FALSE),\"\")),\"\",IF(AND(G23=\"\",G24=\"\",G25=\"\"),VLOOKUP(G5,[3]Sheet1!D98:E104,2,FALSE),\"\"))","v":""}]
[null,"Art and Design Product Design"]
[null,"Art and Design Visual Arts"]
[null,"Art and Design Visual Communication"]
[null,"Business"]
[null,"CPLD"]
[null,"Construction and the Built Environment"]
[null,"Creative Digital Media Production"]
[null,"Engineering"]
[null,"Health and Social Care"]
[null,"Hospitality"]
[null,"Information and Creative Technology"]
[null,"Music"]
[null,"Public Services"]
[null,"Performing Arts Acting"]
[null,"Performing Arts Dance"]
[null,"Performing Arts Musical Theatre"]
[null,"Performing Arts Production"]
[null,"Sport"]
[null,"Travel and Tourism"]
[null,null,"U"]
[null,null,"L1"]
[null,null,"P"]
[null,null,"M"]
[null,null,"D"]

{"sheet":"Cert Unit Data","index":6,"n_rows":157,"n_cols":24,"rows_kept":157,"cut":false,"hidden":true,"merged":[]}
["Core Units",null,null,null,null,null,null,null,null,null,"Mandatory Units",null,null,null,null,"Certificate Units",null,null,null,null,"Performing Arts (Acting)"]
["Sector","Unit Name","GLH",null,null,"Sector","Unit Name","GLH",null,null,"Sector","Unit Name","GLH",null,null,"Sector","Unit Name","GLH",null,null,"Unit Name","GLH","Type","Group"]
["Art and Design","Unit 1 - Introduction to Specialist Pathways in Art and Design",30,"Internal",null,"Art and Design","Unit 2 - Creative Project in Art and Design",30,"External",null,"Art and Design","Unit 6 - Investigating Contextual References in Art and Design ",30,"Internal",null,"Art and Design","Unit 3 - Communicating Ideas in 2D",30,"Internal",null,"Unit 9 - Performance in Context ",30,"Internal","A"]
["Art and Design Design Crafts","Unit 1 - Introduction to Specialist Pathways in Art and Design",30,"Internal",null,"Art and Design Design Crafts","Unit 2 - Creative Project in Art and Design",30,"Internal",null,"Art and Design Design Crafts","Unit 6 - Investigating Contextual References in Art and Design ",30,"Internal",null,"Art and Design","Unit 4 - Communicating Ideas in 3D",30,"Internal",null,"Unit 10 - Movement Skills",30,"Internal","A"]
["Art and Design Fashion and Textiles","Unit 1 - Introduction to Specialist Pathways in Art and Design",30,"Internal",null,"Art and Design Fashion and Textiles","Unit 2 - Creative Project in Art and Design",30,"Internal",null,"Art and Design Fashion and Textiles","Unit 6 - Investigating Contextual References in Art and Design ",30,"Internal",null,"Art and Design","Unit 5 - Developing an Art and Design Portfolio",30,"Internal",null,"Unit 11 - Devising Performance Work ",30,"Internal","A"]
["Art and Design Photography","Unit 1 - Introduction to Specialist Pathways in Art and Design",30,"Internal",null,"Art and Design Photography","Unit 2 - Creative Project in Art and Design",30,"Internal",null,"Art and Design Photography","Unit 6 - Investigating Contextual References in Art and Design ",30,"Internal",null,"Art and Design","Unit 6 - Investigating Contextual References in Art and Design",30,"Internal",null,"Unit 14 - Voice and Speech for Performers",30,"Internal","A"]
["Art and Design Product Design","Unit 1 - Introduction to Specialist Pathways in Art and Design",30,"Internal",null,"Art and Design Product Design","Unit 2 - Creative Project in Art and Design",30,"Internal",null,"Art and Design Product Design","Unit 6 - Investigating Contextual References in Art and Design ",30,"Internal",null,"Art and Design","Unit 7 - Recording for Creative Intentions in Art and Design",30,"External",null,"Unit 15 - Performing Scripted Plays",30,"Internal","A"]
["Art and Design Visual Arts","Unit 1 - Introduction to Specialist Pathways in Art and Design",30,"Internal",null,"Art and Design Visual Arts","Unit 2 - Creative Project in Art and Design",30,"Internal",null,"Art and Design Visual Arts","Unit 6 - Investigating Contextual References in Art and Design ",30,"Internal",null,"Art and Design","Unit 8 - Using Mobile Devices in Art and Design",30,"Internal",null,"Unit 16 - Contemporary Dance Techniques",30,"Internal","B"]
["Art and Design Visual Communication","Unit 1 - Introduction to Specialist Pathways in Art and Design",30,"Internal",null,"Art and Design Visual Communication","Unit 2 - Creative Project in Art and Design",30,"Internal",null,"Art and Design Visual Communication","Unit 6 - Investigating Contextual References in Art and Design ",30,"Internal",null,"Art and Design","Unit 9 - Design Crafts Briefs",60,"Internal",null,"Unit 17 - Exploring Urban Dance Styles",30,"Internal","B"]
["Business","Unit 1 - Enterprise in the Business World",30,"Internal",null,"Business","Unit 2 - Finance for Business",30,"External",null,"Business","Unit 9 - Principles of Marketing",30,"External",null,"Art and Design","Unit 10 - Fashion Briefs",60,"Internal",null,"Unit 18 - Jazz Dance Techniques ",30,"Internal","B"]
["CPLD","Unit 1 - Patterns of Child Development",30,"External",null,"CPLD","Unit 2 - Promoting Children’s Development Through Play",30,"Internal",null,"CPLD","Unit 3 - The Principles of Early Years Practice",60,"Internal",null,"Art and Design","Unit 11 - Graphic Design Briefs",60,"Internal",null,"Unit 19 - Design Planning for Performance ",30,"Internal","B"]
["Construction and the Built Environment","Unit 1 - Construction Technology ",30,"External",null,"Construction and the Built Environment","Unit 2 - Construction Technology ",30,"Internal",null,"Construction and the Built Environment","Unit 3 - Scientific and Mathematical Applications for Construction",30,"Internal",null,"Art and Design","Unit 12 - Textiles Briefs",60,"Internal",null,"Unit 20 - Realising Costume Design for Performance",30,"Internal","B"]
["Creative Digital Media Production","Unit 1 - Digital Media Sectors and Audiences",30,"External",null,"Creative Digital Media Production","Unit 2 - Planning and Pitching a Digital Media Product ",30,"Internal",null,"Creative Digital Media Production","Unit 8 - Media Industry in Context",30,"External",null,"Art and Design","Unit 13 - Visual Arts Briefs",60,"Internal",null,"Unit 21 - Realising Set Design for Performance ",30,"Internal","B"]
["Engineering","Unit 1 - The Engineered World",30,"External",null,"Engineering","Unit 2 - Investigating an Engineered Product ",30,"Internal",null,"Engineering","Unit 9 - Interpreting and Using Engineering Information",30,"External",null,"Art and Design","Unit 14 - Photography Briefs",60,"Internal",null,"Unit 22 - Realising Prop Design for Performance",30,"Internal","B"]
["Health and Social Care","Unit 1 - Human Lifespan Development",30,"External",null,"Health and Social Care","Unit 2 - Health and Social Care Values",30,"Internal",null,"Health and Social Care","Unit 3 - Effective Communication in Health and Social Care",30,"Internal",null,"Art and Design","Unit 15 - Designing for the Future",60,"Internal",null,"Unit 23 - Realising Mask Design for Performance",30,"Internal","B"]
["Hospitality","Unit 1 - Introducing the Hospitality Industry",30,"External",null,"Hospitality","Unit 2 - Working in the Hospitality Industry",30,"Internal",null,"Hospitality","Unit 3 - Food Safety and Health and Safety in Hospitality",30,"Internal",null,"Business","Unit 3 - Promoting a Brand",30,"Internal",null,"Unit 24 - Lighting for Performance ",30,"Internal","B"]
["Information and Creative Technology","Unit 1 - The Online World",30,"External",null,"Information and Creative Technology","Unit 2 - Technology Systems",30,"External",null,"Information and Creative Technology","Unit 3 - A Digital Portfolio",30,"Internal",null,"Business","Unit 4 - Principles of Customer Service",30,"Internal",null,"Unit 25 - Sound for Performance",30,"Internal","B"]
["Music","Unit 1 - The Music Industry",30,"External",null,"Music","Unit 2 - Managing a Music Product ",30,"Internal",null,"Music","Unit 8 - Music and Production Analysis",30,"External",null,"Business","Unit 5 - Sales and Personal Selling",30,"Internal",null,"Unit 28 - Make-up for Performance",30,"Internal","B"]
["Public Services","Unit 1 - The Role and Work of the Public Services",30,"External",null,"Public Services","Unit 2 - Working Skills in the Public Service Sector",30,"Internal",null,"Public Services","Unit 6 - Citizenship, Society and the Public Services",30,"External",null,"Business","Unit 6 - Introducing Retail Business",30,"Internal",null,"Unit 29 - Wardrobe for Stage Performance",30,"Internal","B"]
["Performing Arts Acting","Unit 1 - Individual Showcase ",30,"External",null,"Performing Arts Acting","Unit 2 - Preparation, Performance and Production ",30,"Internal",null,"Performing Arts Acting","Unit 3 - Acting Skills",60,"Internal",null,"Business","Unit 7 - Providing Business Support",30,"Internal"]
["Performing Arts Dance","Unit 1 - Individual Showcase ",30,"External",null,"Performing Arts Dance","Unit 2 - Preparation, Performance and Production ",30,"Internal",null,"Performing Arts Dance","Unit 4 - Dance Skills",60,"Internal",null,"Business","Unit 8 - Recruitment, Selection and Employment",30,"Internal"]
["Performing Arts Musical Theatre","Unit 1 - Individual Showcase ",30,"External",null,"Performing Arts Musical Theatre","Unit 2 - Preparation, Performance and Production ",30,"Internal",null,"Performing Arts Musical Theatre","Unit 5 - Musical Theatre Skills",60,"Internal",null,"Business","Unit 10 - Using Business Documentation",30,"Internal",null,"Performing Arts (Dance)"]
["Performing Arts Production","Unit 1 - Individual Showcase ",30,"External",null,"Performing Arts Production","Unit 2 - Preparation, Performance and Production ",30,"Internal",null,"Performing Arts Production","Unit 7 - Production Skills for Performance",60,"Internal",null,"Business","Unit 11 - Building Successful Business Teams",30,"Internal",null,"Unit Name","GLH","Type","Group"]
["Sport","Unit 1 - Fitness for Sport and Exercise",30,"External",null,"Sport","Unit 2 - Practical Sports Performance ",30,"Internal",null,"Sport","Unit 7 - Anatomy and Physiology for Sports Performance",30,"External",null,"Business","Unit 12 - Introducing Law and Consumer Rights",30,"Internal",null,"Unit 9 - Performance in Context ",30,"Internal","A"]
["Travel and Tourism","Unit 1 - The UK Travel and Tourism Sector",30,"External",null,"Travel and Tourism","Unit 2 - UK Travel and Tourism Destinations ",30,"Internal",null,"Travel and Tourism","Unit 4 - International Travel and Tourism Destinations ",30,"Internal",null,"Business","Unit 13 - Financial Planning and Forecasting",30,"Internal",null,"Unit 10 - Movement Skills",30,"Internal","A"]
[null,null,null,null,null,null,null,null,null,null,null,null,null,null,null,"Business","Unit 14 - Business Online",60,"Internal",null,"Unit 11 - Devising Performance Work ",30,"Internal","A"]
[null,null,null,null,null,null,null,null,null,null,null,null,null,null,null,"Business","Unit 15 - Public Sector Business",30,"Internal",null,"Unit 16 - Contemporary Dance Techniques",30,"Internal","A"]
[null,null,null,null,null,null,null,null,null,null,null,null,null,null,null,"CPLD","Unit 5 - Health and Safety in Early Years Settings",30,"Internal",null,"Unit 17 - Exploring Urban Dance Styles",30,"Internal","A"]
[null,null,null,null,null,null,null,null,null,null,null,null,null,null,null,"CPLD","Unit 6 - Supporting Children’s Language and Literacy Development",30,"Internal",null,"Unit 18 - Jazz Dance Techniques ",30,"Internal","A"]
["U",1,0,null,null,null,null,null,null,null,"Art and Design","Unit 7 - Recording for Creative Intentions in Art and Design",30,"External",null,"CPLD","Unit 7 - Making Healthy Food Choices for Children",30,"Internal",null,"Unit 14 - Voice and Speech for Performers",30,"Internal","B"]
["L1",2,2,null,null,null,null,null,null,null,"Art and Design Design Crafts","Unit 7 - Recording for Creative Intentions in Art and Design",30,"External",null,"CPLD","Unit 8 - Introduction to Working in the Early Years Sector",30,"Internal",null,"Unit 15 - Performing Scripted Plays",30,"Internal","B"]
["P",3,4,null,null,null,null,null,null,null,"Art and Design Fashion and Textiles","Unit 7 - Recording for Creative Intentions in Art and Design",30,"External",null,"Construction and the Built Environment","Unit 4 - Construction Processes and Operations",30,"Internal",null,"Unit 19 - Design Planning for Performance ",30,"Internal","B"]
["M",4,6,null,null,null,null,null,null,null,"Art and Design Photography","Unit 7 - Recording for Creative Intentions in Art and Design",30,"External",null,"Construction and the Built Environment","Unit 5 - Construction Drawing Techniques",30,"Internal",null,"Unit 20 - Realising Costume Design for Performance",30,"Internal","B"]
["D",5,8,null,null,null,null,null,null,null,"Art and Design Product Design","Unit 7 - Recording for Creative Intentions in Art and Design",30,"External",null,"Construction and the Built Environment","Unit 6 - Exploring Carpentry and Joinery Principles and Techniques",30,"Internal",null,"Unit 21 - Realising Set Design for Performance ",30,"Internal","B"]
[null,null,null,null,null,null,null,null,null,null,"Art and Design Visual Arts","Unit 7 - Recording for Creative Intentions in Art and Design",30,"External",null,"Construction and the Built Environment","Unit 7 - Exploring Brickwork and Blockwork Principles and Techniques",30,"Internal",null,"Unit 22 - Realising Prop Design for Performance",30,"Internal","B"]
[{"$f":"Award!J9","v":"L1"},null,null,null,null,null,null,null,null,null,"Art and Design Visual Communication","Unit 7 - Recording for Creative Intentions in Art and Design",30,"External",null,"Construction and the Built Environment","Unit 8 - Exploring Painting and Decorating Principles and Techniques",30,"Internal",null,"Unit 23 - Realising Mask Design for Performance",30,"Internal","B"]
[{"$f":"Award!J10","v":"P"},null,null,null,null,null,null,null,null,null,"Business",null," "," ",null,"Construction and the Built Environment","Unit 9 - Exploring Plumbing Principles and Techniques",30,"Internal",null,"Unit 24 - Lighting for Performance ",30,"Internal","B"]
[{"$f":"Award!J11","v":"P"},null,null,null,null,null,null,null,null,null,"CPLD","Unit 4 - Promoting Children’s Positive Behaviour",30,"External",null,"Construction and the Built Environment","Unit 10 - Exploring Electrical Principles and Techniques",30,"Internal",null,"Unit 25 - Sound for Performance",30,"Internal","B"]
[{"$f":"Award!J12","v":"D"},null,null,null,null,null,null,null,null,null,"Construction and the Built Environment","Unit 11 - Sustainability in Construction",30,"External",null,"Construction and the Built Environment","Unit 12 - The Construction Industry",30,"Internal",null,"Unit 28 - Make-up for Performance",30,"Internal","B"]
[null,null,null,null,null,null,null,null,null,null,"Creative Digital Media Production",null,null,null,null,"Construction and the Built Environment","Unit 13 - Exploring Roofing Principles and Techniques",30,"Internal",null,"Unit 29 - Wardrobe for Stage Performance",30,"Internal","B"]
[{"$f":"Certificate!I9","v":0},null,null,null,null,null,null,null,null,null,"Engineering","Unit 10 - Mathematics for Engineering",30,"Internal",null,"Construction and the Built Environment","Unit 14 - Exploring Wall and Floor Tiling Principles and Techniques",30,"Internal"]
[{"$f":"Certificate!I10","v":0},null,null,null,null,null,null,null,null,null,"Health and Social Care","Unit 9 - Healthy Living ",30,"External",null,"Construction and the Built Environment","Unit 15 - Exploring Plastering and Dry Lining Principles and Techniques",30,"Internal"]
[{"$f":"Certificate!I12","v":0},null,null,null,null,null,null,null,null,null,"Hospitality","Unit 9 - How the Hospitality Industry Contributes to Healthy Lifestyles",30,"External",null,"Creative Digital Media Production","Unit 3 - Digital Moving Image Production",30,"Internal",null,"Unit Name","GLH","Type","Group"]
[{"$f":"Certificate!I13","v":0},null,null,null,null,null,null,null,null,null,"Information and Creative Technology",null," "," ",null,"Creative Digital Media Production","Unit 4 - Digital Audio Production",30,"Internal",null,"Unit 9 - Performance in Context ",30,"Internal","A"]
[{"$f":"Certificate!I14","v":0},null,null,null,null,null,null,null,null,null,"Music",null," "," ",null,"Creative Digital Media Production","Unit 5 - Digital Publishing Production",30,"Internal",null,"Unit 10 - Movement Skills",30,"Internal","A"]
[{"$f":"Certificate!I15","v":0},null,null,null,null,null,null,null,null,null,"Performing Arts Acting","Unit 8 - The Performing Arts Industry ",30,"External",null,"Creative Digital Media Production","Unit 6 - Website Production",30,"Internal",null,"Unit 11 - Devising Performance Work ",30,"Internal","A"]
[{"$f":"Certificate!I17","v":0},null,null,null,null,null,null,null,null,null,"Performing Arts Dance","Unit 8 - The Performing Arts Industry ",30,"External",null,"Creative Digital Media Production","Unit 7 - Digital Games Production",30,"Internal",null,"Unit 15 - Performing Scripted Plays",30,"Internal","B"]
[{"$f":"Certificate!I18","v":0},null,null,null,null,null,null,null,null,null,"Performing Arts Musical Theatre","Unit 8 - The Performing Arts Industry ",30,"External",null,"Creative Digital Media Production","Unit 9 - Digital Editing for Moving Image",60,"Internal",null,"Unit 16 - Contemporary Dance Techniques",30,"Internal","B"]
[{"$f":"Certificate!I19","v":0},null,null,null,null,null,null,null,null,null,"Performing Arts Production","Unit 8 - The Performing Arts Industry ",30,"External",null,"Creative Digital Media Production","Unit 10 - Digital Photography for a Media Product",60,"Internal",null,"Unit 17 - Exploring Urban Dance Styles",30,"Internal","B"]
[{"$f":"Certificate!I20","v":0},null,null,null,null,null,null,null,null,null,"Sport",null," "," ",null,"Creative Digital Media Production","Unit 11 - Animation for Digital Media",60,"Internal",null,"Unit 18 - Jazz Dance Techniques ",30,"Internal","B"]
[{"$f":"Certificate!I21","v":0},null,null,null,null,null,null,null,null,null,"Travel and Tourism","Unit 7 - Travel and Tourism Business Environments",30,"External",null,"Creative Digital Media Production","Unit 12 - Digital Audio Editing",30,"Internal",null,"Unit 19 - Design Planning for Performance ",30,"Internal","B"]
[{"$f":"Certificate!I23","v":0},null,null,null,null,null,null,null,null,null,null,null,null,null,null,"Creative Digital Media Production","Unit 13 - Graphic Design for Digital Media",30,"Internal",null,"Unit 21 - Realising Set Design for Performance ",30,"Internal","B"]
[{"$f":"Certificate!I24","v":0},null,null,null,null,null,null,null,null,null,"Art and Design",null," "," ",null,"Creative Digital Media Production","Unit 14 - Writing for Digital Media",30,"Internal",null,"Unit 22 - Realising Prop Design for Performance",30,"Internal","B"]
[{"$f":"Certificate!I25","v":0},null,null,null,null,null,null,null,null,null,"Art and Design Design Crafts","Unit 9 - Design Crafts Briefs",60,"Internal",null,"Creative Digital Media Production","Unit 15 - Digital Games Testing",30,"Internal",null,"Unit 23 - Realising Mask Design for Performance",30,"Internal","B"]
[{"$f":"Certificate!I26","v":0},null,null,null,null,null,null,null,null,null,"Art and Design Fashion and Textiles","Unit 10 - Fashion Briefs",60,"Internal",null,"Engineering","Unit 3 - Health and Safety in Engineering",30,"Internal",null,"Unit 24 - Lighting for Performance ",30,"Internal","B"]
[null,null,null,null,null,null,null,null,null,null,"Art and Design Photography","Unit 14 - Photography Briefs",60,"Internal",null,"Engineering","Unit 4 - Engineering Maintenance",30,"Internal",null,"Unit 25 - Sound for Performance",30,"Internal","B"]
[null,null,null,null,null,null,null,null,null,null,"Art and Design Product Design","Unit 15 - Designing for the Future",60,"Internal",null,"Engineering","Unit 5 - Engineering Materials",30,"Internal",null,"Unit 28 - Make-up for Performance",30,"Internal","B"]
[null,null,null,null,null,null,null,null,null,null,"Art and Design Visual Arts","Unit 13 - Visual Arts Briefs",60,"Internal",null,"Engineering","Unit 6 - Computer-aided Engineering",30,"Internal",null,"Unit 29 - Wardrobe for Stage Performance",30,"Internal","B"]
[null,null,null,null,null,null,null,null,null,null,"Art and Design Visual Communication","Unit 11 - Graphic Design Briefs",60,"Internal",null,"Engineering","Unit 7 - Machining Techniques",60,"Internal"]
[null,null,null,null,null,null,null,null,null,null,"Business",null," "," ",null,"Engineering","Unit 8 - Electronic Circuit Design and Construction",60,"Internal"]
[null,null,null,null,null,null,null,null,null,null,"CPLD",null," "," ",null,"Engineering","Unit 11 - Electrical and Mechanical Science for Engineering",30,"Internal",null,"Performing Arts (Production)"]
[null,null,null,null,null,null,null,null,null,null,"Construction and the Built Environment",null," "," ",null,"Engineering","Unit 12 - Engineering Design",60,"Internal",null,"Unit Name","GLH","Type","Group"]
[null,null,null,null,null,null,null,null,null,null,"Creative Digital Media Production",null," "," ",null,"Engineering","Unit 13 - Engineering Assembly",30,"Internal",null,"Unit 9 - Performance in Context ",30,"Internal","A"]
[null,null,null,null,null,null,null,null,null,null,"Engineering",null," "," ",null,"Engineering","Unit 14 - Vehicle Engines and Other Systems",30,"Internal",null,"Unit 19 - Design Planning for Performance ",30,"Internal","A"]
[null,null,null,null,null,null,null,null,null,null,"Health and Social Care",null," "," ",null,"Health and Social Care","Unit 4 - Social Influences on Health and Wellbeing",30,"Internal",null,"Unit 20 - Realising Costume Design for Performance",30,"Internal","A"]
[null,null,null,null,null,null,null,null,null,null,"Hospitality",null," "," ",null,"Health and Social Care","Unit 5 - Promoting Health and Wellbeing",30,"Internal",null,"Unit 21 - Realising Set Design for Performance ",30,"Internal","A"]
[null,null,null,null,null,null,null,null,null,null,"Information and Creative Technology",null," "," ",null,"Health and Social Care","Unit 6 - The Impact of Nutrition on Health and Wellbeing",30,"Internal",null,"Unit 22 - Realising Prop Design for Performance",30,"Internal","A"]
[null,null,null,null,null,null,null,null,null,null,"Music",null," "," ",null,"Health and Social Care","Unit 7 - Equality and Diversity in Health and Social Care",30,"Internal",null,"Unit 23 - Realising Mask Design for Performance",30,"Internal","A"]
[null,null,null,null,null,null,null,null,null,null,"Performing Arts Acting",null," "," ",null,"Health and Social Care","Unit 8 - Individual Rights in Health and Social Care",30,"Internal",null,"Unit 24 - Lighting for Performance ",30,"Internal","A"]
[null,null,null,null,null,null,null,null,null,null,"Performing Arts Dance",null," "," ",null,"Health and Social Care","Unit 10 - Human Body Systems and Care of Disorders",60,"Internal",null,"Unit 25 - Sound for Performance",30,"Internal","A"]
[null,null,null,null,null,null,null,null,null,null,"Performing Arts Musical Theatre",null," "," ",null,"Health and Social Care","Unit 11 - Services in Health and Social Care",30,"Internal",null,"Unit 28 - Make-up for Performance",30,"Internal","A"]
[null,null,null,null,null,null,null,null,null,null,"Performing Arts Production",null," "," ",null,"Health and Social Care","Unit 12 - Creative and Therapeutic Activities in Health and Social Care",60,"Internal",null,"Unit 29 - Wardrobe for Stage Performance",30,"Internal","A"]
[null,null,null,null,null,null,null,null,null,null,"Sport",null," "," ",null,"Hospitality","Unit 4 - Costing and Controlling Finances in the Hospitality Industry",30,"Internal",null,"Unit 11 - Devising Performance Work ",30,"Internal","B"]
[null,null,null,null,null,null,null,null,null,null,"Travel and Tourism",null," "," ",null,"Hospitality","Unit 5 - Enterprise in the Hospitality Industry",30,"Internal",null,"Unit 14 - Voice and Speech for Performers",30,"Internal","B"]
[null,null,null,null,null,null,null,null,null,null,null,null,null,null,null,"Hospitality","Unit 6 - Planning, Preparing, Cooking and Finishing Food",30,"Internal",null,"Unit 15 - Performing Scripted Plays",30,"Internal","B"]
[null,null,null,null,null,null,null,null,null,null,null,null,null,null,null,"Hospitality","Unit 7 - Food and Beverage Service in the Hospitality Industry",30,"Internal",null,"Unit 16 - Contemporary Dance Techniques",30,"Internal","B"]
[null,null,null,null,null,null,null,null,null,null,null,null,null,null,null,"Hospitality","Unit 8 - Front Office Services in the Hospitality Industry",30,"Internal",null,"Unit 17 - Exploring Urban Dance Styles",30,"Internal","B"]
[null,null,null,null,null,null,null,null,null,null,null,null,null,null,null,"Hospitality","Unit 10 - Marketing and Promotion in Hospitality",30,"Internal",null,"Unit 18 - Jazz Dance Techniques ",30,"Internal","B"]
[null,null,null,null,null,null,null,null,null,null,null,null,null,null,null,"Hospitality","Unit 11 - Accommodation Services in the Hospitality Industry",30,"Internal"]
[null,null,null,null,null,null,null,null,null,null,"Art and Design",null," "," ",null,"Hospitality","Unit 12 - Planning and Running a Hospitality Event",60,"Internal"]
[null,null,null,null,null,null,null,null,null,null,"Art and Design Design Crafts",null," "," ",null,"Hospitality","Unit 13 - Contemporary World Food Cooking Skills",60,"Internal"]
[null,null,null,null,null,null,null,null,null,null,"Art and Design Fashion and Textiles","Unit 12 - Textiles Briefs",60,"Internal",null,"Information and Creative Technology","Unit 4 - Creating Digital Animation",30,"Internal",null,"Performing Arts"]
[null,null,null,null,null,null,null,null,null,null,"Art and Design Photography",null," "," ",null,"Information and Creative Technology","Unit 5 - Creating Digital Audio",30,"Internal",null,"Unit Name","GLH","Type","Group"]
[null,null,null,null,null,null,null,null,null,null,"Art and Design Product Design",null," "," ",null,"Information and Creative Technology","Unit 6 - Creating Digital Graphics",30,"Internal",null,"Unit 3 - Acting Skills",30,"Internal","A"]
[null,null,null,null,null,null,null,null,null,null,"Art and Design Visual Arts",null," "," ",null,"Information and Creative Technology","Unit 7 - Creating Digital Video",30,"Internal",null,"Unit 4 - Dance Skills",30,"Internal","A"]
[null,null,null,null,null,null,null,null,null,null,"Art and Design Visual Communication",null," "," ",null,"Information and Creative Technology","Unit 8 - Mobile Apps Development",30,"Internal",null,"Unit 5 - Musical Theatre Skills ",30,"Internal","A"]
[null,null,null,null,null,null,null,null,null,null,"Business",null," "," ",null,"Information and Creative Technology","Unit 9 - Spreadsheet Development",30,"Internal",null,"Unit 6 - Music Performance Skills",30,"Internal","A"]
[null,null,null,null,null,null,null,null,null,null,"CPLD",null," "," ",null,"Information and Creative Technology","Unit 10 - Database Development",60,"Internal",null,"Unit 7 - Production Skills for Performance",30,"Internal","A"]
[null,null,null,null,null,null,null,null,null,null,"Construction and the Built Environment",null," "," ",null,"Information and Creative Technology","Unit 11 - Computer Networks",60,"Internal",null,"Unit 9 - Performance in Context ",30,"Internal","B"]
[null,null,null,null,null,null,null,null,null,null,"Creative Digital Media Production",null," "," ",null,"Information and Creative Technology","Unit 12 - Software Development",60,"Internal",null,"Unit 10 - Movement Skills",30,"Internal","B"]
[null,null,null,null,null,null,null,null,null,null,"Engineering",null," "," ",null,"Information and Creative Technology","Unit 13 - Website Development",60,"Internal",null,"Unit 11 - Devising Performance Work ",30,"Internal","B"]
[null,null,null,null,null,null,null,null,null,null,"Health and Social Care",null," "," ",null,"Information and Creative Technology","Unit 14 - Installing and Maintaining Computer Hardware",60,"Internal",null,"Unit 12 - Exploring Improvisation ",30,"Internal","B"]
[null,null,null,null,null,null,null,null,null,null,"Information and Creative Technology",null," "," ",null,"Information and Creative Technology","Unit 15 - Installing and Maintaining Computer Software",60,"Internal",null,"Unit 13 - Multimedia Performance",30,"Internal","B"]
[null,null,null,null,null,null,null,null,null,null,"Hospitality",null," "," ",null,"Information and Creative Technology","Unit 16 - Automated Computer Systems",60,"Internal",null,"Unit 14 - Voice and Speech for Performers",30,"Internal","B"]
[null,null,null,null,null,null,null,null,null,null,"Music",null," "," ",null,"Information and Creative Technology","Unit 17 - Multimedia Products Development",60,"Internal",null,"Unit 15 - Performing Scripted Plays",30,"Internal","B"]
[null,null,null,null,null,null,null,null,null,null,"Performing Arts Acting",null," "," ",null,"Music","Unit 3 - Introducing Live Sound",30,"Internal",null,"Unit 16 - Contemporary Dance Techniques",30,"Internal","B"]
[null,null,null,null,null,null,null,null,null,null,"Performing Arts Dance",null," "," ",null,"Music","Unit 4 - Introducing Music Composition",30,"Internal",null,"Unit 17 - Exploring Urban Dance Styles",30,"Internal","B"]
[null,null,null,null,null,null,null,null,null,null,"Performing Arts Musical Theatre",null," "," ",null,"Music","Unit 5 - Introducing Music Performance",30,"Internal",null,"Unit 18 - Jazz Dance Techniques ",30,"Internal","B"]
[null,null,null,null,null,null,null,null,null,null,"Performing Arts Production",null," "," ",null,"Music","Unit 6 - Introducing Music Recording",30,"Internal",null,"Unit 19 - Design Planning for Performance ",30,"Internal","B"]
[null,null,null,null,null,null,null,null,null,null,"Sport",null," "," ",null,"Music","Unit 7 - Introducing Music Sequencing",30,"Internal",null,"Unit 20 - Realising Costume Design for Performance",30,"Internal","B"]
[null,null,null,null,null,null,null,null,null,null,"Travel and Tourism",null," "," ",null,"Music","Unit 9 - Introducing Choral Studies",30,"Internal",null,"Unit 21 - Realising Set Design for Performance ",30,"Internal","B"]
[null,null,null,null,null,null,null,null,null,null,null,null," "," ",null,"Music","Unit 10 - Introducing Music Theory",30,"Internal",null,"Unit 22 - Realising Prop Design for Performance",30,"Internal","B"]
[null,null,null,null,null,null,null,null,null,null,null,null,null,null,null,"Music","Unit 11 - Developing Solo Music Performance",60,"Internal",null,"Unit 23 - Realising Mask Design for Performance",30,"Internal","B"]
[null,null,null,null,null,null,null,null,null,null,null,null,null,null,null,"Music","Unit 12 - The Development of Music",60,"Internal",null,"Unit 24 - Lighting for Performance ",30,"Internal","B"]
[null,null,null,null,null,null,null,null,null,null,null,null,null,null,null,"Music","Unit 13 - Developing Music Composition",60,"Internal",null,"Unit 25 - Sound for Performance",30,"Internal","B"]
[null,null,null,null,null,null,null,null,null,null,null,null,null,null,null,"Music","Unit 14 - Producing a Music Recording",60,"Internal",null,"Unit 26 - Supporting Performance: Stage Management ",30,"Internal","B"]
[null,null,null,null,null,null,null,null,null,null,null,null,null,null,null,"Music","Unit 15 - Music Ensemble",60,"Internal",null,"Unit 27 - Supporting Performance: Front of House",30,"Internal","B"]
[null,null,null,null,null,null,null,null,null,null,null,null,null,null,null,"Public Services","Unit 3 - Employment in the Public Services",30,"Internal",null,"Unit 28 - Make-up for Performance",30,"Internal","B"]
[null,null,null,null,null,null,null,null,null,null,null,null,null,null,null,"Public Services","Unit 4 - Public Services and Community Protection",30,"Internal",null,"Unit 29 - Wardrobe for Stage Performance",30,"Internal","B"]
[null,null,null,null,null,null,null,null,null,null,null,null,null,null,null,"Public Services","Unit 5 - Health, Fitness and Lifestyle for the Public Services",30,"Internal"]
[null,null,null,null,null,null,null,null,null,null,null,null,null,null,null,"Public Services","Unit 7 - Crime and its Effects on Society and Individuals",60,"Internal"]
[null,null,null,null,null,null,null,null,null,null,null,null,null,null,null,"Public Services","Unit 8 - Promotion of Public Service Provision",30,"Internal"]
[null,null,null,null,null,null,null,null,null,null,null,null,null,null,null,"Public Services","Unit 9 - Community and Cultural Awareness",30,"Internal"]
[null,null,null,null,null,null,null,null,null,null,null,null,null,null,null,"Public Services","Unit 10 - Adventurous Activities in the Public Services",30,"Internal"]
[null,null,null,null,null,null,null,null,null,null,null,null,null,null,null,"Public Services","Unit 11 - Sport and Recreation in the Public Services",30,"Internal"]
[null,null,null,null,null,null,null,null,null,null,null,null,null,null,null,"Public Services","Unit 12 - Land Navigation by Map and Compass",60,"Internal"]
[null,null,null,null,null,null,null,null,null,null,null,null,null,null,null,"Performing Arts","Unit 3 - Acting Skills",60,"Internal"]
[null,null,null,null,null,null,null,null,null,null,null,null,null,null,null,"Performing Arts","Unit 4 - Dance Skills",30,"Internal"]
[null,null,null,null,null,null,null,null,null,null,null,null,null,null,null,"Performing Arts","Unit 5 - Musical Theatre Skills",30,"Internal"]
[null,null,null,null,null,null,null,null,null,null,null,null,null,null,null,"Performing Arts","Unit 6 - Music Performance Skills",30,"Internal"]
[null,null,null,null,null,null,null,null,null,null,null,null,null,null,null,"Performing Arts","Unit 7 - Production Skills for Performance",30,"Internal"]
[null,null,null,null,null,null,null,null,null,null,null,null,null,null,null,"Performing Arts","Unit 9 - Performance in Context",30,"Internal"]
[null,null,null,null,null,null,null,null,null,null,null,null,null,null,null,"Performing Arts","Unit 10 - Movement Skills",30,"Internal"]
[null,null,null,null,null,null,null,null,null,null,null,null,null,null,null,"Performing Arts","Unit 11 - Devising Performance Work",30,"Internal"]
[null,null,null,null,null,null,null,null,null,null,null,null,null,null,null,"Performing Arts","Unit 12 - Exploring Improvisation",30,"Internal"]
[null,null,null,null,null,null,null,null,null,null,null,null,null,null,null,"Performing Arts","Unit 13 - Multimedia Performance",30,"Internal"]
[null,null,null,null,null,null,null,null,null,null,null,null,null,null,null,"Performing Arts","Unit 14 - Voice and Speech for Performers",30,"Internal"]
[null,null,null,null,null,null,null,null,null,null,null,null,null,null,null,"Performing Arts","Unit 15 - Performing Scripted Plays",30,"Internal"]
[null,null,null,null,null,null,null,null,null,null,null,null,null,null,null,"Performing Arts","Unit 16 - Contemporary Dance Techniques",30,"Internal"]
[null,null,null,null,null,null,null,null,null,null,null,null,null,null,null,"Performing Arts","Unit 17 - Exploring Urban Dance Styles",30,"Internal"]
[null,null,null,null,null,null,null,null,null,null,null,null,null,null,null,"Performing Arts","Unit 18 - Jazz Dance Techniques",30,"Internal"]
[null,null,null,null,null,null,null,null,null,null,null,null,null,null,null,"Performing Arts","Unit 19 - Design Planning for Performance",30,"Internal"]
[null,null,null,null,null,null,null,null,null,null,null,null,null,null,null,"Performing Arts","Unit 20 - Realising Costume Design for Performance",30,"Internal"]
[null,null,null,null,null,null,null,null,null,null,null,null,null,null,null,"Performing Arts","Unit 21 - Realising Set Design for Performance",30,"Internal"]
[null,null,null,null,null,null,null,null,null,null,null,null,null,null,null,"Performing Arts","Unit 22 - Realising Prop Design for Performance",30,"Internal"]
[null,null,null,null,null,null,null,null,null,null,null,null,null,null,null,"Performing Arts","Unit 23 - Realising Mask Design for Performance",30,"Internal"]
[null,null,null,null,null,null,null,null,null,null,null,null,null,null,null,"Performing Arts","Unit 24 - Lighting for Performance",30,"Internal"]
[null,null,null,null,null,null,null,null,null,null,null,null,null,null,null,"Performing Arts","Unit 25 - Sound for Performance",30,"Internal"]
[null,null,null,null,null,null,null,null,null,null,null,null,null,null,null,"Performing Arts","Unit 26 - Supporting Performance: Stage Management",30,"Internal"]
[null,null,null,null,null,null,null,null,null,null,null,null,null,null,null,"Performing Arts","Unit 27 - Supporting Performance: Front of House",30,"Internal"]
[null,null,null,null,null,null,null,null,null,null,null,null,null,null,null,"Performing Arts","Unit 28 - Make-up for Performance",30,"Internal"]
[null,null,null,null,null,null,null,null,null,null,null,null,null,null,null,"Performing Arts","Unit 29 - Wardrobe for Stage Performance",30,"Internal"]
[null,null,null,null,null,null,null,null,null,null,null,null,null,null,null,"Sport","Unit 3 - The Mind and Sports Performance",30,"Internal"]
[null,null,null,null,null,null,null,null,null,null,null,null,null,null,null,"Sport","Unit 4 - The Sports Performer in Action",30,"Internal"]
[null,null,null,null,null,null,null,null,null,null,null,null,null,null,null,"Sport","Unit 5 - Training for Personal Fitness",30,"Internal"]
[null,null,null,null,null,null,null,null,null,null,null,null,null,null,null,"Sport","Unit 6 - Leading Sports Activities",30,"Internal"]
[null,null,null,null,null,null,null,null,null,null,null,null,null,null,null,"Sport","Unit 8 - Promotion and Sponsorship in Sport",30,"Internal"]
[null,null,null,null,null,null,null,null,null,null,null,null,null,null,null,"Sport","Unit 9 - Lifestyle and Well-being",30,"Internal"]
[null,null,null,null,null,null,null,null,null,null,null,null,null,null,null,"Sport","Unit 10 - Injury and the Sports Performer",30,"Internal"]
[null,null,null,null,null,null,null,null,null,null,null,null,null,null,null,"Sport","Unit 11 - Running a Sports Event",30,"Internal"]
[null,null,null,null,null,null,null,null,null,null,null,null,null,null,null,"Sport","Unit 12 - The Sport and Active Leisure Industry",30,"Internal"]
[null,null,null,null,null,null,null,null,null,null,null,null,null,null,null,"Travel and Tourism","Unit 3 - The Development of Travel and Tourism in the UK",30,"Internal"]
[null,null,null,null,null,null,null,null,null,null,null,null,null,null,null,"Travel and Tourism","Unit 5 - Factors Affecting Worldwide Travel and Tourism",30,"Internal"]
[null,null,null,null,null,null,null,null,null,null,null,null,null,null,null,"Travel and Tourism","Unit 6 -The Travel and Tourism Customer Experience",30,"Internal"]
[null,null,null,null,null,null,null,null,null,null,null,null,null,null,null,"Travel and Tourism","Unit 8 - Promotion and Sales in Travel and Tourism",30,"Internal"]
[null,null,null,null,null,null,null,null,null,null,null,null,null,null,null,"Travel and Tourism","Unit 9 - Travel and Tourism Employment Opportunities",30,"Internal"]
[null,null,null,null,null,null,null,null,null,null,null,null,null,null,null,"Travel and Tourism","Unit 10 - Organising a Travel and Tourism Study Visit",30,"Internal"]

{"sheet":"Cert Validation","index":7,"n_rows":44,"n_cols":139,"rows_kept":44,"cut":false,"hidden":true,"merged":[]}
["Art and Design",null,null,null,"Business",null,null,null,"CPLD",null,null,null,"Construction",null,null,null,"CDMP",null,null,null,"Engineering",null,null,null,"H&SC",null,null,null,"Hospitality A",null,null,null,"ICT Mand",null,null,null,"ICT Opt",null,null,null,"Music A",null,null,null,"Performing Arts",null,null,null,"Group B",null,null,null,null,null,null,null,"Performing Arts (Acting)",null,null,null,"Group B",null,null,null,"Group B",null,null,null,"Performing Arts (Dance)",null,null,null,"Group B",null,null,null,"Performing Arts (Musical Theatre)",null,null,null,"Group B",null,null,null,"Performing Arts (Production)",null,null,null,"Group B",null,null,null,"Sport",null,null,null,"Travel and Tourism",null,null,null,"CDMP Optional B",null,null,null,"A&D Design Crafts",null,null,null,"A&D Photography",null,null,null,"A&D Product Design",null,null,null,"A&D Visual Arts",null,null,null,"A&D Visual Communication",null,null,null,"No Optional Group B",null,null,null,"Hospitality B",null,null,null,"Music B",null,null,null,"Public Serices"]
[{"$f":"IF(OR(A24=1,A27=1),\"\",\"Unit 3 - Communicating Ideas in 2D\")","v":"Unit 3 - Communicating Ideas in 2D"},{"$f":"IF(COUNTIF(Certificate!$G$17:$G$21,A2)>=1,\"\",ROW())","v":2},{"$f":"IF(ROW(A2)-ROW(A$2)+1>COUNT(B$2:B$12),\"\",INDEX(A:A,SMALL(B$2:B$12,1+ROW(A2)-ROW(A$2))))","v":"Unit 3 - Communicating Ideas in 2D"},null,"Unit 3 - Promoting a Brand",{"$f":"IF(COUNTIF(Certificate!$G$17:$G$21,E2)>=1,\"\",ROW())","v":2},{"$f":"IF(ROW(E2)-ROW(E$2)+1>COUNT(F$2:F$13),\"\",INDEX(E:E,SMALL(F$2:F$13,1+ROW(E2)-ROW(E$2))))","v":"Unit 3 - Promoting a Brand"},null,"Unit 5 - Health and Safety in Early Years Settings",{"$f":"IF(COUNTIF(Certificate!$G$17:$G$21,I2)>=1,\"\",ROW())","v":2},{"$f":"IF(ROW(I2)-ROW(I$2)+1>COUNT(J$2:J$5),\"\",INDEX(I:I,SMALL(J$2:J$5,1+ROW(I2)-ROW(I$2))))","v":"Unit 5 - Health and Safety in Early Years Settings"},null,"Unit 4 - Construction Processes and Operations",{"$f":"IF(COUNTIF(Certificate!$G$17:$G$21,M2)>=1,\"\",ROW())","v":2},{"$f":"IF(ROW(M2)-ROW(M$2)+1>COUNT(N$2:N$12),\"\",INDEX(M:M,SMALL(N$2:N$12,1+ROW(M2)-ROW(M$2))))","v":"Unit 4 - Construction Processes and Operations"},null,"Unit 3 - Digital Moving Image Production",{"$f":"IF(COUNTIF(Certificate!$G$17:$G$21,Q2)>=1,\"\",ROW())","v":2},{"$f":"IF(ROW(Q2)-ROW(Q$2)+1>COUNT(R$2:R$7),\"\",INDEX(Q:Q,SMALL(R$2:R$7,1+ROW(Q2)-ROW(Q$2))))","v":"Unit 3 - Digital Moving Image Production"},null,"Unit 3 - Health and Safety in Engineering",{"$f":"IF(COUNTIF(Certificate!$G$17:$G$21,U2)>=1,\"\",ROW())","v":2},{"$f":"IF(ROW(U2)-ROW(U$2)+1>COUNT(V$2:V$11),\"\",INDEX(U:U,SMALL(V$2:V$11,1+ROW(U2)-ROW(U$2))))","v":"Unit 3 - Health and Safety in Engineering"},null,"Unit 4 - Social Influences on Health and Wellbeing",{"$f":"IF(COUNTIF(Certificate!$G$17:$G$21,Y2)>=1,\"\",ROW())","v":2},{"$f":"IF(ROW(Y2)-ROW(Y$2)+1>COUNT(Z$2:Z$9),\"\",INDEX(Y:Y,SMALL(Z$2:Z$9,1+ROW(Y2)-ROW(Y$2))))","v":"Unit 4 - Social Influences on Health and Wellbeing"},null,"Unit 4 - Costing and Controlling Finances in the Hospitality Industry",{"$f":"IF(COUNTIF(Certificate!$G$17:$G$21,AC2)>=1,\"\",ROW())","v":2},{"$f":"IF(ROW(AC2)-ROW(AC$2)+1>COUNT(AD$2:AD$4),\"\",INDEX(AC:AC,SMALL(AD$2:AD$4,1+ROW(AC2)-ROW(AC$2))))","v":"Unit 4 - Costing and Controlling Finances in the Hospitality Industry"},null,"Unit 1 - The Online World",{"$f":"IF(COUNTIF(Certificate!$G$17:$G$21,AG2)>=1,\"\",ROW())","v":2},{"$f":"IF(ROW(AG2)-ROW(AG$2)+1>COUNT(AH$2:AH$3),\"\",INDEX(AG:AG,SMALL(AH$2:AH$3,1+ROW(AG2)-ROW(AG$2))))","v":"Unit 1 - The Online World"},null,"Unit 4 - Creating Digital Animation",{"$f":"IF(COUNTIF(Certificate!$G$17:$G$21,AK2)>=1,\"\",ROW())","v":2},{"$f":"IF(ROW(AK2)-ROW(AK$2)+1>COUNT(AL$2:AL$15),\"\",INDEX(AK:AK,SMALL(AL$2:AL$15,1+ROW(AK2)-ROW(AK$2))))","v":"Unit 4 - Creating Digital Animation"},null,"Unit 3 - Introducing Live Sound",{"$f":"IF(COUNTIF(Certificate!$G$17:$G$21,AO2)>=1,\"\",ROW())","v":2},{"$f":"IF(ROW(AO2)-ROW(AO$2)+1>COUNT(AP$2:AP$8),\"\",INDEX(AO:AO,SMALL(AP$2:AP$8,1+ROW(AO2)-ROW(AO$2))))","v":"Unit 3 - Introducing Live Sound"},null,"Unit 3 - Acting Skills",{"$f":"IF(COUNTIF(Certificate!$G$17:$G$19,AS2)>=1,\"\",ROW())","v":2},{"$f":"IF(ROW(AS2)-ROW(AS$2)+1>COUNT(AT$2:AT$6),\"\",INDEX(AS:AS,SMALL(AT$2:AT$6,1+ROW(AS2)-ROW(AS$2))))","v":"Unit 3 - Acting Skills"},null,"Unit 9 - Performance in Context",{"$f":"IF(COUNTIF(Certificate!$G$23:$G$25,AW2)>=1,\"\",ROW())","v":2},{"$f":"IF(ROW(AW2)-ROW(AW$2)+1>COUNT(AX$2:AX$22),\"\",INDEX(AW:AW,SMALL(AX$2:AX$22,1+ROW(AW2)-ROW(AW$2))))","v":"Unit 9 - Performance in Context"},null,"Unit 9 - Performance in Context",{"$f":"IF(COUNTIF(Certificate!$G$23:$G$25,BA2)>=1,\"\",ROW())","v":2},{"$f":"IF(ROW(BA2)-ROW(BA$2)+1>COUNT(BB$2:BB$22),\"\",INDEX(BA:BA,SMALL(BB$2:BB$22,1+ROW(BA2)-ROW(BA$2))))","v":"Unit 9 - Performance in Context"},null,"Unit 9 - Performance in Context",{"$f":"IF(COUNTIF(Certificate!$G$17:$G$21,BE2)>=1,\"\",ROW())","v":2},{"$f":"IF(ROW(BE2)-ROW(BE$2)+1>COUNT(BF$2:BF$6),\"\",INDEX(BE:BE,SMALL(BF$2:BF$6,1+ROW(BE2)-ROW(BE$2))))","v":"Unit 9 - Performance in Context"},null,"Unit 16 - Contemporary Dance Techniques",{"$f":"IF(COUNTIF(Certificate!$G$23:$G$25,BI2)>=1,\"\",ROW())","v":2},{"$f":"IF(ROW(BI2)-ROW(BI$2)+1>COUNT(BJ$2:BJ$13),\"\",INDEX(BI:BI,SMALL(BJ$2:BJ$13,1+ROW(BI2)-ROW(BI$2))))","v":"Unit 16 - Contemporary Dance Techniques"},null,"Only one optional unit from Group B permitted",{"$f":"IF(COUNTIF(Certificate!$G$23:$G$23,BM2)>=1,\"\",ROW())","v":2},"Only one optional unit from Group B permitted",null,"Unit 9 - Performance in Context",{"$f":"IF(COUNTIF(Certificate!$G$17:$G$19,BQ2)>=1,\"\",ROW())","v":2},{"$f":"IF(ROW(BQ2)-ROW(BQ$2)+1>COUNT(BR$2:BR$7),\"\",INDEX(BQ:BQ,SMALL(BR$2:BR$7,1+ROW(BQ2)-ROW(BQ$2))))","v":"Unit 9 - Performance in Context"},null,"Unit 14 - Voice and Speech for Performers",{"$f":"IF(COUNTIF(Certificate!$G$23:$G$25,BU2)>=1,\"\",ROW())","v":2},{"$f":"IF(ROW(BU2)-ROW(BU$2)+1>COUNT(BV$2:BV$12),\"\",INDEX(BU:BU,SMALL(BV$2:BV$12,1+ROW(BU2)-ROW(BU$2))))","v":"Unit 14 - Voice and Speech for Performers"},null,"Unit 9 - Performance in Context",{"$f":"IF(COUNTIF(Certificate!$G$17:$G$19,BY2)>=1,\"\",ROW())","v":2},{"$f":"IF(ROW(BY2)-ROW(BY$2)+1>COUNT(BZ$2:BZ$6),\"\",INDEX(BY:BY,SMALL(BZ$2:BZ$6,1+ROW(BY2)-ROW(BY$2))))","v":"Unit 9 - Performance in Context"},null,"Unit 15 - Performing Scripted Plays",{"$f":"IF(COUNTIF(Certificate!$G$23:$G$25,CC2)>=1,\"\",ROW())","v":2},{"$f":"IF(ROW(CC2)-ROW(CC$2)+1>COUNT(CD$2:CD$14),\"\",INDEX(CC:CC,SMALL(CD$2:CD$14,1+ROW(CC2)-ROW(CC$2))))","v":"Unit 15 - Performing Scripted Plays"},null,"Unit 9 - Performance in Context",{"$f":"IF(COUNTIF(Certificate!$G$17:$G$19,CG2)>=1,\"\",ROW())","v":2},{"$f":"IF(ROW(CG2)-ROW(CG$2)+1>COUNT(CH$2:CH$11),\"\",INDEX(CG:CG,SMALL(CH$2:CH$11,1+ROW(CG2)-ROW(CG$2))))","v":"Unit 9 - Performance in Context"},null,"Unit 11 - Devising Performance Work",{"$f":"IF(COUNTIF(Certificate!$G$23:$G$25,CK2)>=1,\"\",ROW())","v":2},{"$f":"IF(ROW(CK2)-ROW(CK$2)+1>COUNT(CL$2:CL$7),\"\",INDEX(CK:CK,SMALL(CL$2:CL$7,1+ROW(CK2)-ROW(CK$2))))","v":"Unit 11 - Devising Performance Work"},null,"Unit 3 - The Mind and Sports Performance",{"$f":"IF(COUNTIF(Certificate!$G$17:$G$21,CO2)>=1,\"\",ROW())","v":2},{"$f":"IF(ROW(CO2)-ROW(CO$2)+1>COUNT(CP$2:CP$10),\"\",INDEX(CO:CO,SMALL(CP$2:CP$10,1+ROW(CO2)-ROW(CO$2))))","v":"Unit 3 - The Mind and Sports Performance"},null,"Unit 3 - The Development of Travel and Tourism in the UK",{"$f":"IF(COUNTIF(Certificate!$G$17:$G$21,CS2)>=1,\"\",ROW())","v":2},{"$f":"IF(ROW(CS2)-ROW(CS$2)+1>COUNT(CT$2:CT$7),\"\",INDEX(CS:CS,SMALL(CT$2:CT$7,1+ROW(CS2)-ROW(CS$2))))","v":"Unit 3 - The Development of Travel and Tourism in the UK"},null,"Unit 9 - Digital Editing for Moving Image",{"$f":"IF(COUNTIF(Certificate!$G$23:$G$25,CW2)>=1,\"\",ROW())","v":2},{"$f":"IF(ROW(CW2)-ROW(CW$2)+1>COUNT(CX$2:CX$8),\"\",INDEX(CW:CW,SMALL(CX$2:CX$8,1+ROW(CW2)-ROW(CW$2))))","v":"Unit 9 - Digital Editing for Moving Image"},null,"Unit 3 - Communicating Ideas in 2D",{"$f":"IF(COUNTIF(Certificate!$G$17:$G$21,DA2)>=1,\"\",ROW())","v":2},{"$f":"IF(ROW(DA2)-ROW(DA$2)+1>COUNT(DB$2:DB$6),\"\",INDEX(DA:DA,SMALL(DB$2:DB$6,1+ROW(DA2)-ROW(DA$2))))","v":"Unit 3 - Communicating Ideas in 2D"},null,"Unit 3 - Communicating Ideas in 2D",{"$f":"IF(COUNTIF(Certificate!$G$17:$G$21,DE2)>=1,\"\",ROW())","v":2},{"$f":"IF(ROW(DE2)-ROW(DE$2)+1>COUNT(DF$2:DF$7),\"\",INDEX(DE:DE,SMALL(DF$2:DF$7,1+ROW(DE2)-ROW(DE$2))))","v":"Unit 3 - Communicating Ideas in 2D"},null,{"$f":"IF(DI14=1,\"\",\"Unit 3 - Communicating Ideas in 2D\")","v":"Unit 3 - Communicating Ideas in 2D"},{"$f":"IF(COUNTIF(Certificate!$G$17:$G$21,DI2)>=1,\"\",ROW())","v":2},{"$f":"IF(ROW(DI2)-ROW(DI$2)+1>COUNT(DJ$2:DJ$8),\"\",INDEX(DI:DI,SMALL(DJ$2:DJ$8,1+ROW(DI2)-ROW(DI$2))))","v":"Unit 3 - Communicating Ideas in 2D"},null,"Unit 5 - Developing an Art and Design Portfolio",{"$f":"IF(COUNTIF(Certificate!$G$17:$G$21,DM2)>=1,\"\",ROW())","v":2},{"$f":"IF(ROW(DM2)-ROW(DM$2)+1>COUNT(DN$2:DN$8),\"\",INDEX(DM:DM,SMALL(DN$2:DN$8,1+ROW(DM2)-ROW(DM$2))))","v":"Unit 5 - Developing an Art and Design Portfolio"},null,"Unit 4 - Communicating Ideas in 3D",{"$f":"IF(COUNTIF(Certificate!$G$17:$G$21,DQ2)>=1,\"\",ROW())","v":2},{"$f":"IF(ROW(DQ2)-ROW(DQ$2)+1>COUNT(DR$2:DR$7),\"\",INDEX(DQ:DQ,SMALL(DR$2:DR$7,1+ROW(DQ2)-ROW(DQ$2))))","v":"Unit 4 - Communicating Ideas in 3D"},null,"N/A",{"$f":"IF(COUNTIF(Certificate!$G$17:$G$21,DU2)>=1,\"\",ROW())","v":2},"N/A",null,"Unit 6 - Planning, Preparing, Cooking and Finishing Food",{"$f":"IF(COUNTIF(Certificate!$G$23:$G$25,DY2)>=1,\"\",ROW())","v":2},{"$f":"IF(ROW(DY2)-ROW(DY$2)+1>COUNT(DZ$2:DZ$7),\"\",INDEX(DY:DY,SMALL(DZ$2:DZ$7,1+ROW(DY2)-ROW(DY$2))))","v":"Unit 6 - Planning, Preparing, Cooking and Finishing Food"},null,"Unit 11 - Developing Solo Music Performance",{"$f":"IF(COUNTIF(Certificate!$G$23:$G$25,EC2)>=1,\"\",ROW())","v":2},{"$f":"IF(ROW(EC2)-ROW(EC$2)+1>COUNT(ED$2:ED$6),\"\",INDEX(EC:EC,SMALL(ED$2:ED$6,1+ROW(EC2)-ROW(EC$2))))","v":"Unit 11 - Developing Solo Music Performance"},null,"Unit 3 - Employment in the Public Services",{"$f":"IF(COUNTIF(Certificate!$G$17:$G$21,EG2)>=1,\"\",ROW())","v":2},{"$f":"IF(ROW(EG2)-ROW(EG$2)+1>COUNT(EH$2:EH$10),\"\",INDEX(EG:EG,SMALL(EH$2:EH$10,1+ROW(EG2)-ROW(EG$2))))","v":"Unit 3 - Employment in the Public Services"}]
[{"$f":"IF(OR(A21=1,A27=1),\"\",\"Unit 4 - Communicating Ideas in 3D\")","v":"Unit 4 - Communicating Ideas in 3D"},{"$f":"IF(COUNTIF(Certificate!$G$17:$G$21,A3)>=1,\"\",ROW())","v":3},"Unit 4 - Communicating Ideas in 3D",null,"Unit 4 - Principles of Customer Service",{"$f":"IF(COUNTIF(Certificate!$G$17:$G$21,E3)>=1,\"\",ROW())","v":3},"Unit 4 - Principles of Customer Service",null,"Unit 6 - Supporting Children’s Language and Literacy Development",{"$f":"IF(COUNTIF(Certificate!$G$17:$G$21,I3)>=1,\"\",ROW())","v":3},{"$f":"IF(ROW(I3)-ROW(I$2)+1>COUNT(J$2:J$5),\"\",INDEX(I:I,SMALL(J$2:J$5,1+ROW(I3)-ROW(I$2))))","v":"Unit 6 - Supporting Children’s Language and Literacy Development"},null,"Unit 5 - Construction Drawing Techniques",{"$f":"IF(COUNTIF(Certificate!$G$17:$G$21,M3)>=1,\"\",ROW())","v":3},"Unit 5 - Construction Drawing Techniques",null,"Unit 4 - Digital Audio Production",{"$f":"IF(COUNTIF(Certificate!$G$17:$G$21,Q3)>=1,\"\",ROW())","v":3},{"$f":"IF(ROW(Q3)-ROW(Q$2)+1>COUNT(R$2:R$7),\"\",INDEX(Q:Q,SMALL(R$2:R$7,1+ROW(Q3)-ROW(Q$2))))","v":"Unit 4 - Digital Audio Production"},null,"Unit 4 - Engineering Maintenance",{"$f":"IF(COUNTIF(Certificate!$G$17:$G$21,U3)>=1,\"\",ROW())","v":3},"Unit 4 - Engineering Maintenance",null,"Unit 5 - Promoting Health and Wellbeing",{"$f":"IF(COUNTIF(Certificate!$G$17:$G$21,Y3)>=1,\"\",ROW())","v":3},"Unit 5 - Promoting Health and Wellbeing",null,"Unit 5 - Enterprise in the Hospitality Industry",{"$f":"IF(COUNTIF(Certificate!$G$17:$G$21,AC3)>=1,\"\",ROW())","v":3},{"$f":"IF(ROW(AC3)-ROW(AC$2)+1>COUNT(AD$2:AD$4),\"\",INDEX(AC:AC,SMALL(AD$2:AD$4,1+ROW(AC3)-ROW(AC$2))))","v":"Unit 5 - Enterprise in the Hospitality Industry"},null,"Unit 2 - Technology Systems",{"$f":"IF(COUNTIF(Certificate!$G$17:$G$21,AG3)>=1,\"\",ROW())","v":3},{"$f":"IF(ROW(AG3)-ROW(AG$2)+1>COUNT(AH$2:AH$3),\"\",INDEX(AG:AG,SMALL(AH$2:AH$3,1+ROW(AG3)-ROW(AG$2))))","v":"Unit 2 - Technology Systems"},null,"Unit 5 - Creating Digital Audio",{"$f":"IF(COUNTIF(Certificate!$G$17:$G$21,AK3)>=1,\"\",ROW())","v":3},"Unit 5 - Creating Digital Audio",null,"Unit 4 - Introducing Music Composition",{"$f":"IF(COUNTIF(Certificate!$G$17:$G$21,AO3)>=1,\"\",ROW())","v":3},"Unit 4 - Introducing Music Composition",null,"Unit 4 - Dance Skills",{"$f":"IF(COUNTIF(Certificate!$G$17:$G$19,AS3)>=1,\"\",ROW())","v":3},"Unit 4 - Dance Skills",null,"Unit 10 - Movement Skills",{"$f":"IF(COUNTIF(Certificate!$G$23:$G$25,AW3)>=1,\"\",ROW())","v":3},"Unit 10 - Movement Skills",null,"Unit 10 - Movement Skills",{"$f":"IF(COUNTIF(Certificate!$G$23:$G$25,BA3)>=1,\"\",ROW())","v":3},"Unit 10 - Movement Skills",null,"Unit 10 - Movement Skills",{"$f":"IF(COUNTIF(Certificate!$G$17:$G$21,BE3)>=1,\"\",ROW())","v":3},{"$f":"IF(ROW(BE3)-ROW(BE$2)+1>COUNT(BF$2:BF$6),\"\",INDEX(BE:BE,SMALL(BF$2:BF$6,1+ROW(BE3)-ROW(BE$2))))","v":"Unit 10 - Movement Skills"},null,"Unit 17 - Exploring Urban Dance Styles",{"$f":"IF(COUNTIF(Certificate!$G$23:$G$25,BI3)>=1,\"\",ROW())","v":3},"Unit 17 - Exploring Urban Dance Styles",null,null,null,null,null,"Unit 10 - Movement Skills",{"$f":"IF(COUNTIF(Certificate!$G$17:$G$19,BQ3)>=1,\"\",ROW())","v":3},"Unit 10 - Movement Skills",null,"Unit 15 - Performing Scripted Plays",{"$f":"IF(COUNTIF(Certificate!$G$23:$G$25,BU3)>=1,\"\",ROW())","v":3},"Unit 15 - Performing Scripted Plays",null,"Unit 10 - Movement Skills",{"$f":"IF(COUNTIF(Certificate!$G$17:$G$19,BY3)>=1,\"\",ROW())","v":3},{"$f":"IF(ROW(BY3)-ROW(BY$2)+1>COUNT(BZ$2:BZ$6),\"\",INDEX(BE:BE,SMALL(BZ$2:BZ$6,1+ROW(BY3)-ROW(BY$2))))","v":"Unit 10 - Movement Skills"},null,"Unit 16 - Contemporary Dance Techniques",{"$f":"IF(COUNTIF(Certificate!$G$23:$G$25,CC3)>=1,\"\",ROW())","v":3},"Unit 16 - Contemporary Dance Techniques",null,"Unit 19 - Design Planning for Performance",{"$f":"IF(COUNTIF(Certificate!$G$17:$G$19,CG3)>=1,\"\",ROW())","v":3},"Unit 19 - Design Planning for Performance",null,"Unit 14 - Voice and Speech for Performers",{"$f":"IF(COUNTIF(Certificate!$G$23:$G$25,CK3)>=1,\"\",ROW())","v":3},"Unit 14 - Voice and Speech for Performers",null,"Unit 4 - The Sports Performer in Action",{"$f":"IF(COUNTIF(Certificate!$G$17:$G$21,CO3)>=1,\"\",ROW())","v":3},"Unit 4 - The Sports Performer in Action",null,"Unit 5 - Factors Affecting Worldwide Travel and Tourism",{"$f":"IF(COUNTIF(Certificate!$G$17:$G$21,CS3)>=1,\"\",ROW())","v":3},"Unit 5 - Factors Affecting Worldwide Travel and Tourism",null,"Unit 10 - Digital Photography for a Media Product",{"$f":"IF(COUNTIF(Certificate!$G$23:$G$25,CW3)>=1,\"\",ROW())","v":3},"Unit 10 - Digital Photography for a Media Product",null,"Unit 5 - Developing an Art and Design Portfolio",{"$f":"IF(COUNTIF(Certificate!$G$17:$G$21,DA3)>=1,\"\",ROW())","v":3},{"$f":"IF(ROW(DA3)-ROW(DA$2)+1>COUNT(DB$2:DB$6),\"\",INDEX(DA:DA,SMALL(DB$2:DB$6,1+ROW(DA3)-ROW(DA$2))))","v":"Unit 5 - Developing an Art and Design Portfolio"},null,"Unit 4 - Communicating Ideas in 3D",{"$f":"IF(COUNTIF(Certificate!$G$17:$G$21,DE3)>=1,\"\",ROW())","v":3},"Unit 4 - Communicating Ideas in 3D",null,"Unit 4 - Communicating Ideas in 3D",{"$f":"IF(COUNTIF(Certificate!$G$17:$G$21,DI3)>=1,\"\",ROW())","v":3},"Unit 4 - Communicating Ideas in 3D",null,"Unit 8 - Using Mobile Devices in Art and Design",{"$f":"IF(COUNTIF(Certificate!$G$17:$G$21,DM3)>=1,\"\",ROW())","v":3},"Unit 8 - Using Mobile Devices in Art and Design",null,"Unit 5 - Developing an Art and Design Portfolio",{"$f":"IF(COUNTIF(Certificate!$G$17:$G$21,DQ3)>=1,\"\",ROW())","v":3},"Unit 5 - Developing an Art and Design Portfolio",null,null,null,null,null,"Unit 7 - Food and Beverage Service in the Hospitality Industry",{"$f":"IF(COUNTIF(Certificate!$G$23:$G$25,DY3)>=1,\"\",ROW())","v":3},"Unit 7 - Food and Beverage Service in the Hospitality Industry",null,"Unit 12 - The Development of Music",{"$f":"IF(COUNTIF(Certificate!$G$23:$G$25,EC3)>=1,\"\",ROW())","v":3},{"$f":"IF(ROW(EC3)-ROW(EC$2)+1>COUNT(ED$2:ED$6),\"\",INDEX(EC:EC,SMALL(ED$2:ED$6,1+ROW(EC3)-ROW(EC$2))))","v":"Unit 12 - The Development of Music"},null,"Unit 4 - Public Services and Community Protection",{"$f":"IF(COUNTIF(Certificate!$G$17:$G$21,EG3)>=1,\"\",ROW())","v":3},{"$f":"IF(ROW(EG3)-ROW(EG$2)+1>COUNT(EH$2:EH$10),\"\",INDEX(EG:EG,SMALL(EH$2:EH$10,1+ROW(EG3)-ROW(EG$2))))","v":"Unit 4 - Public Services and Community Protection"}]
["Unit 5 - Developing an Art and Design Portfolio",{"$f":"IF(COUNTIF(Certificate!$G$17:$G$21,A4)>=1,\"\",ROW())","v":4},"Unit 5 - Developing an Art and Design Portfolio",null,"Unit 5 - Sales and Personal Selling",{"$f":"IF(COUNTIF(Certificate!$G$17:$G$21,E4)>=1,\"\",ROW())","v":4},"Unit 5 - Sales and Personal Selling",null,"Unit 7 - Making Healthy Food Choices for Children",{"$f":"IF(COUNTIF(Certificate!$G$17:$G$21,I4)>=1,\"\",ROW())","v":4},{"$f":"IF(ROW(I4)-ROW(I$2)+1>COUNT(J$2:J$5),\"\",INDEX(I:I,SMALL(J$2:J$5,1+ROW(I4)-ROW(I$2))))","v":"Unit 7 - Making Healthy Food Choices for Children"},null,"Unit 6 - Exploring Carpentry and Joinery Principles and Techniques",{"$f":"IF(COUNTIF(Certificate!$G$17:$G$21,M4)>=1,\"\",ROW())","v":4},"Unit 6 - Exploring Carpentry and Joinery Principles and Techniques",null,"Unit 5 - Digital Publishing Production",{"$f":"IF(COUNTIF(Certificate!$G$17:$G$21,Q4)>=1,\"\",ROW())","v":4},{"$f":"IF(ROW(Q4)-ROW(Q$2)+1>COUNT(R$2:R$7),\"\",INDEX(Q:Q,SMALL(R$2:R$7,1+ROW(Q4)-ROW(Q$2))))","v":"Unit 5 - Digital Publishing Production"},null,"Unit 5 - Engineering Materials",{"$f":"IF(COUNTIF(Certificate!$G$17:$G$21,U4)>=1,\"\",ROW())","v":4},"Unit 5 - Engineering Materials",null,"Unit 6 - The Impact of Nutrition on Health and Wellbeing",{"$f":"IF(COUNTIF(Certificate!$G$17:$G$21,Y4)>=1,\"\",ROW())","v":4},"Unit 6 - The Impact of Nutrition on Health and Wellbeing",null,"Unit 10 - Marketing and Promotion in Hospitality",{"$f":"IF(COUNTIF(Certificate!$G$17:$G$21,AC4)>=1,\"\",ROW())","v":4},{"$f":"IF(ROW(AC4)-ROW(AC$2)+1>COUNT(AD$2:AD$4),\"\",INDEX(AC:AC,SMALL(AD$2:AD$4,1+ROW(AC4)-ROW(AC$2))))","v":"Unit 10 - Marketing and Promotion in Hospitality"},null,null,null,null,null,"Unit 6 - Creating Digital Graphics",{"$f":"IF(COUNTIF(Certificate!$G$17:$G$21,AK4)>=1,\"\",ROW())","v":4},"Unit 6 - Creating Digital Graphics",null,"Unit 5 - Introducing Music Performance",{"$f":"IF(COUNTIF(Certificate!$G$17:$G$21,AO4)>=1,\"\",ROW())","v":4},"Unit 5 - Introducing Music Performance",null,"Unit 5 - Musical Theatre Skills",{"$f":"IF(COUNTIF(Certificate!$G$17:$G$19,AS4)>=1,\"\",ROW())","v":4},"Unit 5 - Musical Theatre Skills",null,"Unit 11 - Devising Performance Work",{"$f":"IF(COUNTIF(Certificate!$G$23:$G$25,AW4)>=1,\"\",ROW())","v":4},"Unit 11 - Devising Performance Work",null,"Unit 11 - Devising Performance Work",{"$f":"IF(COUNTIF(Certificate!$G$23:$G$25,BA4)>=1,\"\",ROW())","v":4},"Unit 11 - Devising Performance Work",null,"Unit 11 - Devising Performance Work",{"$f":"IF(COUNTIF(Certificate!$G$17:$G$21,BE4)>=1,\"\",ROW())","v":4},{"$f":"IF(ROW(BE4)-ROW(BE$2)+1>COUNT(BF$2:BF$6),\"\",INDEX(BE:BE,SMALL(BF$2:BF$6,1+ROW(BE4)-ROW(BE$2))))","v":"Unit 11 - Devising Performance Work"},null,"Unit 18 - Jazz Dance Techniques",{"$f":"IF(COUNTIF(Certificate!$G$23:$G$25,BI4)>=1,\"\",ROW())","v":4},"Unit 18 - Jazz Dance Techniques",null,null,null,null,null,"Unit 11 - Devising Performance Work",{"$f":"IF(COUNTIF(Certificate!$G$17:$G$19,BQ4)>=1,\"\",ROW())","v":4},"Unit 11 - Devising Performance Work",null,"Unit 19 - Design Planning for Performance",{"$f":"IF(COUNTIF(Certificate!$G$23:$G$25,BU4)>=1,\"\",ROW())","v":4},"Unit 19 - Design Planning for Performance",null,"Unit 11 - Devising Performance Work",{"$f":"IF(COUNTIF(Certificate!$G$17:$G$19,BY4)>=1,\"\",ROW())","v":4},{"$f":"IF(ROW(BY4)-ROW(BY$2)+1>COUNT(BZ$2:BZ$6),\"\",INDEX(BE:BE,SMALL(BZ$2:BZ$6,1+ROW(BY4)-ROW(BY$2))))","v":"Unit 11 - Devising Performance Work"},null,"Unit 17 - Exploring Urban Dance Styles",{"$f":"IF(COUNTIF(Certificate!$G$23:$G$25,CC4)>=1,\"\",ROW())","v":4},"Unit 17 - Exploring Urban Dance Styles",null,"Unit 20 - Realising Costume Design for Performance",{"$f":"IF(COUNTIF(Certificate!$G$17:$G$19,CG4)>=1,\"\",ROW())","v":4},"Unit 20 - Realising Costume Design for Performance",null,"Unit 15 - Performing Scripted Plays",{"$f":"IF(COUNTIF(Certificate!$G$23:$G$25,CK4)>=1,\"\",ROW())","v":4},"Unit 15 - Performing Scripted Plays",null,"Unit 5 - Training for Personal Fitness",{"$f":"IF(COUNTIF(Certificate!$G$17:$G$21,CO4)>=1,\"\",ROW())","v":4},"Unit 5 - Training for Personal Fitness",null,"Unit 6 -The Travel and Tourism Customer Experience",{"$f":"IF(COUNTIF(Certificate!$G$17:$G$21,CS4)>=1,\"\",ROW())","v":4},"Unit 6 -The Travel and Tourism Customer Experience",null,"Unit 11 - Animation for Digital Media",{"$f":"IF(COUNTIF(Certificate!$G$23:$G$25,CW4)>=1,\"\",ROW())","v":4},"Unit 11 - Animation for Digital Media",null,"Unit 10 - Fashion Briefs",{"$f":"IF(COUNTIF(Certificate!$G$17:$G$21,DA4)>=1,\"\",ROW())","v":4},{"$f":"IF(ROW(DA4)-ROW(DA$2)+1>COUNT(DB$2:DB$6),\"\",INDEX(DA:DA,SMALL(DB$2:DB$6,1+ROW(DA4)-ROW(DA$2))))","v":"Unit 10 - Fashion Briefs"},null,"Unit 5 - Developing an Art and Design Portfolio",{"$f":"IF(COUNTIF(Certificate!$G$17:$G$21,DE4)>=1,\"\",ROW())","v":4},"Unit 5 - Developing an Art and Design Portfolio",null,"Unit 5 - Developing an Art and Design Portfolio",{"$f":"IF(COUNTIF(Certificate!$G$17:$G$21,DI4)>=1,\"\",ROW())","v":4},"Unit 5 - Developing an Art and Design Portfolio",null,"Unit 9 - Design Crafts Briefs",{"$f":"IF(COUNTIF(Certificate!$G$17:$G$21,DM4)>=1,\"\",ROW())","v":4},"Unit 9 - Design Crafts Briefs",null,"Unit 8 - Using Mobile Devices in Art and Design",{"$f":"IF(COUNTIF(Certificate!$G$17:$G$21,DQ4)>=1,\"\",ROW())","v":4},"Unit 8 - Using Mobile Devices in Art and Design",null,null,null,null,null,"Unit 8 - Front Office Services in the Hospitality Industry",{"$f":"IF(COUNTIF(Certificate!$G$23:$G$25,DY4)>=1,\"\",ROW())","v":4},"Unit 8 - Front Office Services in the Hospitality Industry",null,"Unit 13 - Developing Music Composition",{"$f":"IF(COUNTIF(Certificate!$G$23:$G$25,EC4)>=1,\"\",ROW())","v":4},{"$f":"IF(ROW(EC4)-ROW(EC$2)+1>COUNT(ED$2:ED$6),\"\",INDEX(EC:EC,SMALL(ED$2:ED$6,1+ROW(EC4)-ROW(EC$2))))","v":"Unit 13 - Developing Music Composition"},null,"Unit 5 - Health, Fitness and Lifestyle for the Public Services",{"$f":"IF(COUNTIF(Certificate!$G$17:$G$21,EG4)>=1,\"\",ROW())","v":4},"Unit 5 - Health, Fitness and Lifestyle for the Public Services"]
["Unit 8 - Using Mobile Devices in Art and Design",{"$f":"IF(COUNTIF(Certificate!$G$17:$G$21,A5)>=1,\"\",ROW())","v":5},"Unit 8 - Using Mobile Devices in Art and Design",null,"Unit 6 - Introducing Retail Business",{"$f":"IF(COUNTIF(Certificate!$G$17:$G$21,E5)>=1,\"\",ROW())","v":5},"Unit 6 - Introducing Retail Business",null,"Unit 8 - Introduction to Working in the Early Years Sector",{"$f":"IF(COUNTIF(Certificate!$G$17:$G$21,I5)>=1,\"\",ROW())","v":5},{"$f":"IF(ROW(I5)-ROW(I$2)+1>COUNT(J$2:J$5),\"\",INDEX(I:I,SMALL(J$2:J$5,1+ROW(I5)-ROW(I$2))))","v":"Unit 8 - Introduction to Working in the Early Years Sector"},null,"Unit 7 - Exploring Brickwork and Blockwork Principles and Techniques",{"$f":"IF(COUNTIF(Certificate!$G$17:$G$21,M5)>=1,\"\",ROW())","v":5},"Unit 7 - Exploring Brickwork and Blockwork Principles and Techniques",null,"Unit 6 - Website Production",{"$f":"IF(COUNTIF(Certificate!$G$17:$G$21,Q5)>=1,\"\",ROW())","v":5},{"$f":"IF(ROW(Q5)-ROW(Q$2)+1>COUNT(R$2:R$7),\"\",INDEX(Q:Q,SMALL(R$2:R$7,1+ROW(Q5)-ROW(Q$2))))","v":"Unit 6 - Website Production"},null,"Unit 6 - Computer-aided Engineering",{"$f":"IF(COUNTIF(Certificate!$G$17:$G$21,U5)>=1,\"\",ROW())","v":5},"Unit 6 - Computer-aided Engineering",null,"Unit 7 - Equality and Diversity in Health and Social Care",{"$f":"IF(COUNTIF(Certificate!$G$17:$G$21,Y5)>=1,\"\",ROW())","v":5},"Unit 7 - Equality and Diversity in Health and Social Care",null,null,null,null,null,null,null,null,null,"Unit 7 - Creating Digital Video",{"$f":"IF(COUNTIF(Certificate!$G$17:$G$21,AK5)>=1,\"\",ROW())","v":5},"Unit 7 - Creating Digital Video",null,"Unit 6 - Introducing Music Recording",{"$f":"IF(COUNTIF(Certificate!$G$17:$G$21,AO5)>=1,\"\",ROW())","v":5},"Unit 6 - Introducing Music Recording",null,"Unit 6 - Music Performance Skills",{"$f":"IF(COUNTIF(Certificate!$G$17:$G$19,AS5)>=1,\"\",ROW())","v":5},"Unit 6 - Music Performance Skills",null,"Unit 12 - Exploring Improvisation",{"$f":"IF(COUNTIF(Certificate!$G$23:$G$25,AW5)>=1,\"\",ROW())","v":5},"Unit 12 - Exploring Improvisation",null,"Unit 12 - Exploring Improvisation",{"$f":"IF(COUNTIF(Certificate!$G$23:$G$25,BA5)>=1,\"\",ROW())","v":5},"Unit 12 - Exploring Improvisation",null,"Unit 14 - Voice and Speech for Performers",{"$f":"IF(COUNTIF(Certificate!$G$17:$G$21,BE5)>=1,\"\",ROW())","v":5},{"$f":"IF(ROW(BE5)-ROW(BE$2)+1>COUNT(BF$2:BF$6),\"\",INDEX(BE:BE,SMALL(BF$2:BF$6,1+ROW(BE5)-ROW(BE$2))))","v":"Unit 14 - Voice and Speech for Performers"},null,"Unit 19 - Design Planning for Performance",{"$f":"IF(COUNTIF(Certificate!$G$23:$G$25,BI5)>=1,\"\",ROW())","v":5},"Unit 19 - Design Planning for Performance",null,null,null,null,null,"Unit 16 - Contemporary Dance Techniques",{"$f":"IF(COUNTIF(Certificate!$G$17:$G$19,BQ5)>=1,\"\",ROW())","v":5},"Unit 16 - Contemporary Dance Techniques",null,"Unit 20 - Realising Costume Design for Performance",{"$f":"IF(COUNTIF(Certificate!$G$23:$G$25,BU5)>=1,\"\",ROW())","v":5},"Unit 20 - Realising Costume Design for Performance",null,"Unit 14 - Voice and Speech for Performers",{"$f":"IF(COUNTIF(Certificate!$G$17:$G$19,BY5)>=1,\"\",ROW())","v":5},{"$f":"IF(ROW(BY5)-ROW(BY$2)+1>COUNT(BZ$2:BZ$6),\"\",INDEX(BE:BE,SMALL(BZ$2:BZ$6,1+ROW(BY5)-ROW(BY$2))))","v":"Unit 14 - Voice and Speech for Performers"},null,"Unit 18 - Jazz Dance Techniques",{"$f":"IF(COUNTIF(Certificate!$G$23:$G$25,CC5)>=1,\"\",ROW())","v":5},"Unit 18 - Jazz Dance Techniques",null,"Unit 21 - Realising Set Design for Performance",{"$f":"IF(COUNTIF(Certificate!$G$17:$G$19,CG5)>=1,\"\",ROW())","v":5},"Unit 21 - Realising Set Design for Performance",null,"Unit 16 - Contemporary Dance Techniques",{"$f":"IF(COUNTIF(Certificate!$G$23:$G$25,CK5)>=1,\"\",ROW())","v":5},"Unit 16 - Contemporary Dance Techniques",null,"Unit 6 - Leading Sports Activities",{"$f":"IF(COUNTIF(Certificate!$G$17:$G$21,CO5)>=1,\"\",ROW())","v":5},"Unit 6 - Leading Sports Activities",null,"Unit 8 - Promotion and Sales in Travel and Tourism",{"$f":"IF(COUNTIF(Certificate!$G$17:$G$21,CS5)>=1,\"\",ROW())","v":5},"Unit 8 - Promotion and Sales in Travel and Tourism",null,"Unit 12 - Digital Audio Editing",{"$f":"IF(COUNTIF(Certificate!$G$23:$G$25,CW5)>=1,\"\",ROW())","v":5},"Unit 12 - Digital Audio Editing",null,"Unit 12 - Textiles Briefs",{"$f":"IF(COUNTIF(Certificate!$G$17:$G$21,DA5)>=1,\"\",ROW())","v":5},{"$f":"IF(ROW(DA5)-ROW(DA$2)+1>COUNT(DB$2:DB$6),\"\",INDEX(DA:DA,SMALL(DB$2:DB$6,1+ROW(DA5)-ROW(DA$2))))","v":"Unit 12 - Textiles Briefs"},null,"Unit 8 - Using Mobile Devices in Art and Design",{"$f":"IF(COUNTIF(Certificate!$G$17:$G$21,DE5)>=1,\"\",ROW())","v":5},"Unit 8 - Using Mobile Devices in Art and Design",null,"Unit 8 - Using Mobile Devices in Art and Design",{"$f":"IF(COUNTIF(Certificate!$G$17:$G$21,DI5)>=1,\"\",ROW())","v":5},"Unit 8 - Using Mobile Devices in Art and Design",null,"Unit 10 - Fashion Briefs",{"$f":"IF(COUNTIF(Certificate!$G$17:$G$21,DM5)>=1,\"\",ROW())","v":5},"Unit 10 - Fashion Briefs",null,"Unit 10 - Fashion Briefs",{"$f":"IF(COUNTIF(Certificate!$G$17:$G$21,DQ5)>=1,\"\",ROW())","v":5},"Unit 10 - Fashion Briefs",null,null,null,null,null,"Unit 11 - Accommodation Services in the Hospitality Industry",{"$f":"IF(COUNTIF(Certificate!$G$23:$G$25,DY5)>=1,\"\",ROW())","v":5},"Unit 11 - Accommodation Services in the Hospitality Industry",null,"Unit 14 - Producing a Music Recording",{"$f":"IF(COUNTIF(Certificate!$G$23:$G$25,EC5)>=1,\"\",ROW())","v":5},{"$f":"IF(ROW(EC5)-ROW(EC$2)+1>COUNT(ED$2:ED$6),\"\",INDEX(EC:EC,SMALL(ED$2:ED$6,1+ROW(EC5)-ROW(EC$2))))","v":"Unit 14 - Producing a Music Recording"},null,"Unit 7 - Crime and its Effects on Society and Individuals",{"$f":"IF(COUNTIF(Certificate!$G$17:$G$21,EG5)>=1,\"\",ROW())","v":5},"Unit 7 - Crime and its Effects on Society and Individuals"]
[{"$f":"IF(A18=1,\"\",\"Unit 9 - Design Crafts Briefs\")","v":"Unit 9 - Design Crafts Briefs"},{"$f":"IF(COUNTIF(Certificate!$G$17:$G$21,A6)>=1,\"\",ROW())","v":6},"Unit 9 - Design Crafts Briefs",null,"Unit 7 - Providing Business Support",{"$f":"IF(COUNTIF(Certificate!$G$17:$G$21,E6)>=1,\"\",ROW())","v":6},"Unit 7 - Providing Business Support",null,null,null,null,null,"Unit 8 - Exploring Painting and Decorating Principles and Techniques",{"$f":"IF(COUNTIF(Certificate!$G$17:$G$21,M6)>=1,\"\",ROW())","v":6},"Unit 8 - Exploring Painting and Decorating Principles and Techniques",null,"Unit 7 - Digital Games Production",{"$f":"IF(COUNTIF(Certificate!$G$17:$G$21,Q6)>=1,\"\",ROW())","v":6},{"$f":"IF(ROW(Q6)-ROW(Q$2)+1>COUNT(R$2:R$6),\"\",INDEX(Q:Q,SMALL(R$2:R$6,1+ROW(Q6)-ROW(Q$2))))","v":"Unit 7 - Digital Games Production"},null,"Unit 7 - Machining Techniques",{"$f":"IF(COUNTIF(Certificate!$G$17:$G$21,U6)>=1,\"\",ROW())","v":6},"Unit 7 - Machining Techniques",null,"Unit 8 - Individual Rights in Health and Social Care",{"$f":"IF(COUNTIF(Certificate!$G$17:$G$21,Y6)>=1,\"\",ROW())","v":6},"Unit 8 - Individual Rights in Health and Social Care",null,null,null,null,null,null,null,null,null,"Unit 8 - Mobile Apps Development",{"$f":"IF(COUNTIF(Certificate!$G$17:$G$21,AK6)>=1,\"\",ROW())","v":6},"Unit 8 - Mobile Apps Development",null,"Unit 7 - Introducing Music Sequencing",{"$f":"IF(COUNTIF(Certificate!$G$17:$G$21,AO6)>=1,\"\",ROW())","v":6},"Unit 7 - Introducing Music Sequencing",null,"Unit 7 - Production Skills for Performance",{"$f":"IF(COUNTIF(Certificate!$G$17:$G$19,AS6)>=1,\"\",ROW())","v":6},"Unit 7 - Production Skills for Performance",null,"Unit 13 - Multimedia Performance",{"$f":"IF(COUNTIF(Certificate!$G$23:$G$25,AW6)>=1,\"\",ROW())","v":6},"Unit 13 - Multimedia Performance",null,"Unit 13 - Multimedia Performance",{"$f":"IF(COUNTIF(Certificate!$G$23:$G$25,BA6)>=1,\"\",ROW())","v":6},"Unit 13 - Multimedia Performance",null,"Unit 15 - Performing Scripted Plays",{"$f":"IF(COUNTIF(Certificate!$G$17:$G$21,BE6)>=1,\"\",ROW())","v":6},{"$f":"IF(ROW(BE6)-ROW(BE$2)+1>COUNT(BF$2:BF$6),\"\",INDEX(BE:BE,SMALL(BF$2:BF$6,1+ROW(BE6)-ROW(BE$2))))","v":"Unit 15 - Performing Scripted Plays"},null,"Unit 20 - Realising Costume Design for Performance",{"$f":"IF(COUNTIF(Certificate!$G$23:$G$25,BI6)>=1,\"\",ROW())","v":6},"Unit 20 - Realising Costume Design for Performance",null,null,null,null,null,"Unit 17 - Exploring Urban Dance Styles",{"$f":"IF(COUNTIF(Certificate!$G$17:$G$19,BQ6)>=1,\"\",ROW())","v":6},"Unit 17 - Exploring Urban Dance Styles",null,"Unit 21 - Realising Set Design for Performance",{"$f":"IF(COUNTIF(Certificate!$G$23:$G$25,BU6)>=1,\"\",ROW())","v":6},"Unit 21 - Realising Set Design for Performance",null,null,null,null,null,"Unit 19 - Design Planning for Performance",{"$f":"IF(COUNTIF(Certificate!$G$23:$G$25,CC6)>=1,\"\",ROW())","v":6},"Unit 19 - Design Planning for Performance",null,"Unit 22 - Realising Prop Design for Performance",{"$f":"IF(COUNTIF(Certificate!$G$17:$G$19,CG6)>=1,\"\",ROW())","v":6},"Unit 22 - Realising Prop Design for Performance",null,"Unit 17 - Exploring Urban Dance Styles",{"$f":"IF(COUNTIF(Certificate!$G$23:$G$25,CK6)>=1,\"\",ROW())","v":6},"Unit 17 - Exploring Urban Dance Styles",null,"Unit 8 - Promotion and Sponsorship in Sport",{"$f":"IF(COUNTIF(Certificate!$G$17:$G$21,CO6)>=1,\"\",ROW())","v":6},"Unit 8 - Promotion and Sponsorship in Sport",null,"Unit 9 - Travel and Tourism Employment Opportunities",{"$f":"IF(COUNTIF(Certificate!$G$17:$G$21,CS6)>=1,\"\",ROW())","v":6},"Unit 9 - Travel and Tourism Employment Opportunities",null,"Unit 13 - Graphic Design for Digital Media",{"$f":"IF(COUNTIF(Certificate!$G$23:$G$25,CW6)>=1,\"\",ROW())","v":6},"Unit 13 - Graphic Design for Digital Media",null,"Unit 15 - Designing for the Future",{"$f":"IF(COUNTIF(Certificate!$G$17:$G$21,DA6)>=1,\"\",ROW())","v":6},{"$f":"IF(ROW(DA6)-ROW(DA$2)+1>COUNT(DB$2:DB$6),\"\",INDEX(DA:DA,SMALL(DB$2:DB$6,1+ROW(DA6)-ROW(DA$2))))","v":"Unit 15 - Designing for the Future"},null,"Unit 10 - Fashion Briefs",{"$f":"IF(COUNTIF(Certificate!$G$17:$G$21,DE6)>=1,\"\",ROW())","v":6},"Unit 10 - Fashion Briefs",null,"Unit 10 - Fashion Briefs",{"$f":"IF(COUNTIF(Certificate!$G$17:$G$21,DI6)>=1,\"\",ROW())","v":6},"Unit 10 - Fashion Briefs",null,"Unit 11 - Graphic Design Briefs",{"$f":"IF(COUNTIF(Certificate!$G$17:$G$21,DM6)>=1,\"\",ROW())","v":6},"Unit 11 - Graphic Design Briefs",null,"Unit 14 - Photography Briefs",{"$f":"IF(COUNTIF(Certificate!$G$17:$G$21,DQ6)>=1,\"\",ROW())","v":6},"Unit 14 - Photography Briefs",null,null,null,null,null,"Unit 12 - Planning and Running a Hospitality Event",{"$f":"IF(COUNTIF(Certificate!$G$23:$G$25,DY6)>=1,\"\",ROW())","v":6},"Unit 12 - Planning and Running a Hospitality Event",null,"Unit 15 - Music Ensemble",{"$f":"IF(COUNTIF(Certificate!$G$23:$G$25,EC6)>=1,\"\",ROW())","v":6},{"$f":"IF(ROW(EC6)-ROW(EC$2)+1>COUNT(ED$2:ED$6),\"\",INDEX(EC:EC,SMALL(ED$2:ED$6,1+ROW(EC6)-ROW(EC$2))))","v":"Unit 15 - Music Ensemble"},null,"Unit 8 - Promotion of Public Service Provision",{"$f":"IF(COUNTIF(Certificate!$G$17:$G$21,EG6)>=1,\"\",ROW())","v":6},"Unit 8 - Promotion of Public Service Provision"]
["Unit 10 - Fashion Briefs",{"$f":"IF(COUNTIF(Certificate!$G$17:$G$21,A7)>=1,\"\",ROW())","v":7},"Unit 10 - Fashion Briefs",null,"Unit 8 - Recruitment, Selection and Employment",{"$f":"IF(COUNTIF(Certificate!$G$17:$G$21,E7)>=1,\"\",ROW())","v":7},"Unit 8 - Recruitment, Selection and Employment",null,null,null,null,null,"Unit 9 - Exploring Plumbing Principles and Techniques",{"$f":"IF(COUNTIF(Certificate!$G$17:$G$21,M7)>=1,\"\",ROW())","v":7},"Unit 9 - Exploring Plumbing Principles and Techniques",null,null,null,null,null,"Unit 8 - Electronic Circuit Design and Construction",{"$f":"IF(COUNTIF(Certificate!$G$17:$G$21,U7)>=1,\"\",ROW())","v":7},"Unit 8 - Electronic Circuit Design and Construction",null,"Unit 10 - Human Body Systems and Care of Disorders",{"$f":"IF(COUNTIF(Certificate!$G$17:$G$21,Y7)>=1,\"\",ROW())","v":7},"Unit 10 - Human Body Systems and Care of Disorders",null,null,null,null,null,null,null,null,null,"Unit 9 - Spreadsheet Development",{"$f":"IF(COUNTIF(Certificate!$G$17:$G$21,AK7)>=1,\"\",ROW())","v":7},"Unit 9 - Spreadsheet Development",null,"Unit 9 - Introducing Choral Studies",{"$f":"IF(COUNTIF(Certificate!$G$17:$G$21,AO7)>=1,\"\",ROW())","v":7},"Unit 9 - Introducing Choral Studies",null,null,null,"",null,"Unit 14 - Voice and Speech for Performers",{"$f":"IF(COUNTIF(Certificate!$G$23:$G$25,AW7)>=1,\"\",ROW())","v":7},"Unit 14 - Voice and Speech for Performers",null,"Unit 14 - Voice and Speech for Performers",{"$f":"IF(COUNTIF(Certificate!$G$23:$G$25,BA7)>=1,\"\",ROW())","v":7},"Unit 14 - Voice and Speech for Performers",null,null,null,null,null,"Unit 21 - Realising Set Design for Performance",{"$f":"IF(COUNTIF(Certificate!$G$23:$G$25,BI7)>=1,\"\",ROW())","v":7},"Unit 21 - Realising Set Design for Performance",null,null,null,null,null,"Unit 18 - Jazz Dance Techniques",{"$f":"IF(COUNTIF(Certificate!$G$17:$G$19,BQ7)>=1,\"\",ROW())","v":7},"Unit 18 - Jazz Dance Techniques",null,"Unit 22 - Realising Prop Design for Performance",{"$f":"IF(COUNTIF(Certificate!$G$23:$G$25,BU7)>=1,\"\",ROW())","v":7},"Unit 22 - Realising Prop Design for Performance",null,null,null,null,null,"Unit 20 - Realising Costume Design for Performance",{"$f":"IF(COUNTIF(Certificate!$G$23:$G$25,CC7)>=1,\"\",ROW())","v":7},"Unit 20 - Realising Costume Design for Performance",null,"Unit 23 - Realising Mask Design for Performance",{"$f":"IF(COUNTIF(Certificate!$G$17:$G$19,CG7)>=1,\"\",ROW())","v":7},"Unit 23 - Realising Mask Design for Performance",null,"Unit 18 - Jazz Dance Techniques",{"$f":"IF(COUNTIF(Certificate!$G$23:$G$25,CK7)>=1,\"\",ROW())","v":7},"Unit 18 - Jazz Dance Techniques",null,"Unit 9 - Lifestyle and Well-being",{"$f":"IF(COUNTIF(Certificate!$G$17:$G$21,CO7)>=1,\"\",ROW())","v":7},"Unit 9 - Lifestyle and Well-being",null,"Unit 10 - Organising a Travel and Tourism Study Visit",{"$f":"IF(COUNTIF(Certificate!$G$17:$G$21,CS7)>=1,\"\",ROW())","v":7},"Unit 10 - Organising a Travel and Tourism Study Visit",null,"Unit 14 - Writing for Digital Media",{"$f":"IF(COUNTIF(Certificate!$G$23:$G$25,CW7)>=1,\"\",ROW())","v":7},"Unit 14 - Writing for Digital Media",null,null,null,null,null,"Unit 15 - Designing for the Future",{"$f":"IF(COUNTIF(Certificate!$G$17:$G$21,DE7)>=1,\"\",ROW())","v":7},"Unit 15 - Designing for the Future",null,{"$f":"IF(DI11=1,\"\",\"Unit 11 - Graphic Design Briefs\")","v":"Unit 11 - Graphic Design Briefs"},{"$f":"IF(COUNTIF(Certificate!$G$17:$G$21,DI7)>=1,\"\",ROW())","v":7},"Unit 11 - Graphic Design Briefs",null,"Unit 12 - Textiles Briefs",{"$f":"IF(COUNTIF(Certificate!$G$17:$G$21,DM7)>=1,\"\",ROW())","v":7},"Unit 12 - Textiles Briefs",null,"Unit 15 - Designing for the Future",{"$f":"IF(COUNTIF(Certificate!$G$17:$G$21,DQ7)>=1,\"\",ROW())","v":7},"Unit 15 - Designing for the Future",null,null,null,null,null,"Unit 13 - Contemporary World Food Cooking Skills",{"$f":"IF(COUNTIF(Certificate!$G$23:$G$25,DY7)>=1,\"\",ROW())","v":7},"Unit 13 - Contemporary World Food Cooking Skills",null,null,null,null,null,"Unit 9 - Community and Cultural Awareness",{"$f":"IF(COUNTIF(Certificate!$G$17:$G$21,EG7)>=1,\"\",ROW())","v":7},"Unit 9 - Community and Cultural Awareness"]
[{"$f":"IF(A15=1,\"\",\"Unit 11 - Graphic Design Briefs\")","v":"Unit 11 - Graphic Design Briefs"},{"$f":"IF(COUNTIF(Certificate!$G$17:$G$21,A8)>=1,\"\",ROW())","v":8},"Unit 11 - Graphic Design Briefs",null,"Unit 10 - Using Business Documentation",{"$f":"IF(COUNTIF(Certificate!$G$17:$G$21,E8)>=1,\"\",ROW())","v":8},"Unit 10 - Using Business Documentation",null,null,null,null,null,"Unit 10 - Exploring Electrical Principles and Techniques",{"$f":"IF(COUNTIF(Certificate!$G$17:$G$21,M8)>=1,\"\",ROW())","v":8},"Unit 10 - Exploring Electrical Principles and Techniques",null,null,null,null,null,"Unit 11 - Electrical and Mechanical Science for Engineering",{"$f":"IF(COUNTIF(Certificate!$G$17:$G$21,U8)>=1,\"\",ROW())","v":8},"Unit 11 - Electrical and Mechanical Science for Engineering",null,"Unit 11 - Services in Health and Social Care",{"$f":"IF(COUNTIF(Certificate!$G$17:$G$21,Y8)>=1,\"\",ROW())","v":8},"Unit 11 - Services in Health and Social Care",null,null,null,null,null,null,null,null,null,"Unit 10 - Database Development",{"$f":"IF(COUNTIF(Certificate!$G$17:$G$21,AK8)>=1,\"\",ROW())","v":8},"Unit 10 - Database Development",null,"Unit 10 - Introducing Music Theory",{"$f":"IF(COUNTIF(Certificate!$G$17:$G$21,AO8)>=1,\"\",ROW())","v":8},"Unit 10 - Introducing Music Theory",null,null,null,null,null,"Unit 15 - Performing Scripted Plays",{"$f":"IF(COUNTIF(Certificate!$G$23:$G$25,AW8)>=1,\"\",ROW())","v":8},"Unit 15 - Performing Scripted Plays",null,"Unit 15 - Performing Scripted Plays",{"$f":"IF(COUNTIF(Certificate!$G$23:$G$25,BA8)>=1,\"\",ROW())","v":8},"Unit 15 - Performing Scripted Plays",null,null,null,null,null,"Unit 22 - Realising Prop Design for Performance",{"$f":"IF(COUNTIF(Certificate!$G$23:$G$25,BI8)>=1,\"\",ROW())","v":8},"Unit 22 - Realising Prop Design for Performance",null,null,null,null,null,null,null,null,null,"Unit 23 - Realising Mask Design for Performance",{"$f":"IF(COUNTIF(Certificate!$G$23:$G$25,BU8)>=1,\"\",ROW())","v":8},"Unit 23 - Realising Mask Design for Performance",null,null,null,null,null,"Unit 21 - Realising Set Design for Performance",{"$f":"IF(COUNTIF(Certificate!$G$23:$G$25,CC8)>=1,\"\",ROW())","v":8},"Unit 21 - Realising Set Design for Performance",null,"Unit 24 - Lighting for Performance",{"$f":"IF(COUNTIF(Certificate!$G$17:$G$19,CG8)>=1,\"\",ROW())","v":8},"Unit 24 - Lighting for Performance",null,null,null,null,null,"Unit 10 - Injury and the Sports Performer",{"$f":"IF(COUNTIF(Certificate!$G$17:$G$21,CO8)>=1,\"\",ROW())","v":8},"Unit 10 - Injury and the Sports Performer",null,null,null,null,null,"Unit 15 - Digital Games Testing",{"$f":"IF(COUNTIF(Certificate!$G$23:$G$25,CW8)>=1,\"\",ROW())","v":8},"Unit 15 - Digital Games Testing",null,null,null,null,null,null,null,null,null,"Unit 12 - Textiles Briefs",{"$f":"IF(COUNTIF(Certificate!$G$17:$G$21,DI8)>=1,\"\",ROW())","v":8},"Unit 12 - Textiles Briefs",null,"Unit 14 - Photography Briefs",{"$f":"IF(COUNTIF(Certificate!$G$17:$G$21,DM8)>=1,\"\",ROW())","v":8},"Unit 14 - Photography Briefs",null,null,null,null,null,null,null,null,null,null,null,null,null,null,null,null,null,"Unit 10 - Adventurous Activities in the Public Services",{"$f":"IF(COUNTIF(Certificate!$G$17:$G$21,EG8)>=1,\"\",ROW())","v":8},"Unit 10 - Adventurous Activities in the Public Services"]
["Unit 12 - Textiles Briefs",{"$f":"IF(COUNTIF(Certificate!$G$17:$G$21,A9)>=1,\"\",ROW())","v":9},"Unit 12 - Textiles Briefs",null,"Unit 11 - Building Successful Business Teams",{"$f":"IF(COUNTIF(Certificate!$G$17:$G$21,E9)>=1,\"\",ROW())","v":9},"Unit 11 - Building Successful Business Teams",null,null,null,null,null,"Unit 12 - The Construction Industry",{"$f":"IF(COUNTIF(Certificate!$G$17:$G$21,M9)>=1,\"\",ROW())","v":9},"Unit 12 - The Construction Industry",null,null,null,null,null,"Unit 12 - Engineering Design",{"$f":"IF(COUNTIF(Certificate!$G$17:$G$21,U9)>=1,\"\",ROW())","v":9},"Unit 12 - Engineering Design",null,"Unit 12 - Creative and Therapeutic Activities in Health and Social Care",{"$f":"IF(COUNTIF(Certificate!$G$17:$G$21,Y9)>=1,\"\",ROW())","v":9},"Unit 12 - Creative and Therapeutic Activities in Health and Social Care",null,null,null,null,null,null,null,null,null,"Unit 11 - Computer Networks",{"$f":"IF(COUNTIF(Certificate!$G$17:$G$21,AK9)>=1,\"\",ROW())","v":9},"Unit 11 - Computer Networks",null,null,null,null,null,null,null,null,null,"Unit 16 - Contemporary Dance Techniques",{"$f":"IF(COUNTIF(Certificate!$G$23:$G$25,AW9)>=1,\"\",ROW())","v":9},"Unit 16 - Contemporary Dance Techniques",null,"Unit 16 - Contemporary Dance Techniques",{"$f":"IF(COUNTIF(Certificate!$G$23:$G$25,BA9)>=1,\"\",ROW())","v":9},"Unit 16 - Contemporary Dance Techniques",null,null,null,null,null,"Unit 23 - Realising Mask Design for Performance",{"$f":"IF(COUNTIF(Certificate!$G$23:$G$25,BI9)>=1,\"\",ROW())","v":9},"Unit 23 - Realising Mask Design for Performance",null,null,null,null,null,null,null,null,null,"Unit 24 - Lighting for Performance",{"$f":"IF(COUNTIF(Certificate!$G$23:$G$25,BU9)>=1,\"\",ROW())","v":9},"Unit 24 - Lighting for Performance",null,null,null,null,null,"Unit 22 - Realising Prop Design for Performance",{"$f":"IF(COUNTIF(Certificate!$G$23:$G$25,CC9)>=1,\"\",ROW())","v":9},"Unit 22 - Realising Prop Design for Performance",null,"Unit 25 - Sound for Performance",{"$f":"IF(COUNTIF(Certificate!$G$17:$G$19,CG9)>=1,\"\",ROW())","v":9},"Unit 25 - Sound for Performance",null,null,null,null,null,"Unit 11 - Running a Sports Event",{"$f":"IF(COUNTIF(Certificate!$G$17:$G$21,CO9)>=1,\"\",ROW())","v":9},"Unit 11 - Running a Sports Event",null,null,null,null,null,null,null,null,null,null,null,null,null,null,null,null,null,null,null,null,null,null,null,null,null,null,null,null,null,null,null,null,null,null,null,null,null,null,null,null,null,"Unit 11 - Sport and Recreation in the Public Services",{"$f":"IF(COUNTIF(Certificate!$G$17:$G$21,EG9)>=1,\"\",ROW())","v":9},"Unit 11 - Sport and Recreation in the Public Services"]
[{"$f":"IF(OR(A15=1,A18=1),\"\",\"Unit 13 - Visual Arts Briefs\")","v":"Unit 13 - Visual Arts Briefs"},{"$f":"IF(COUNTIF(Certificate!$G$17:$G$21,A10)>=1,\"\",ROW())","v":10},"Unit 13 - Visual Arts Briefs",null,"Unit 12 - Introducing Law and Consumer Rights",{"$f":"IF(COUNTIF(Certificate!$G$17:$G$21,E10)>=1,\"\",ROW())","v":10},"Unit 12 - Introducing Law and Consumer Rights",null,null,null,null,null,"Unit 13 - Exploring Roofing Principles and Techniques",{"$f":"IF(COUNTIF(Certificate!$G$17:$G$21,M10)>=1,\"\",ROW())","v":10},"Unit 13 - Exploring Roofing Principles and Techniques",null,null,null,null,null,"Unit 13 - Engineering Assembly",{"$f":"IF(COUNTIF(Certificate!$G$17:$G$21,U10)>=1,\"\",ROW())","v":10},"Unit 13 - Engineering Assembly",null,null,null,null,null,null,null,null,null,null,null,null,null,"Unit 12 - Software Development",{"$f":"IF(COUNTIF(Certificate!$G$17:$G$21,AK10)>=1,\"\",ROW())","v":10},"Unit 12 - Software Development",null,null,null,null,null,null,null,null,null,"Unit 17 - Exploring Urban Dance Styles",{"$f":"IF(COUNTIF(Certificate!$G$23:$G$25,AW10)>=1,\"\",ROW())","v":10},"Unit 17 - Exploring Urban Dance Styles",null,"Unit 17 - Exploring Urban Dance Styles",{"$f":"IF(COUNTIF(Certificate!$G$23:$G$25,BA10)>=1,\"\",ROW())","v":10},"Unit 17 - Exploring Urban Dance Styles",null,null,null,null,null,"Unit 24 - Lighting for Performance",{"$f":"IF(COUNTIF(Certificate!$G$23:$G$25,BI10)>=1,\"\",ROW())","v":10},"Unit 24 - Lighting for Performance",null,null,null,null,null,null,null,null,null,"Unit 25 - Sound for Performance",{"$f":"IF(COUNTIF(Certificate!$G$23:$G$25,BU10)>=1,\"\",ROW())","v":10},"Unit 25 - Sound for Performance",null,null,null,null,null,"Unit 23 - Realising Mask Design for Performance",{"$f":"IF(COUNTIF(Certificate!$G$23:$G$25,CC10)>=1,\"\",ROW())","v":10},"Unit 23 - Realising Mask Design for Performance",null,"Unit 28 - Make-up for Performance",{"$f":"IF(COUNTIF(Certificate!$G$17:$G$19,CG10)>=1,\"\",ROW())","v":10},"Unit 28 - Make-up for Performance",null,null,null,null,null,"Unit 12 - The Sport and Active Leisure Industry",{"$f":"IF(COUNTIF(Certificate!$G$17:$G$21,CO10)>=1,\"\",ROW())","v":10},"Unit 12 - The Sport and Active Leisure Industry",null,null,null,null,null,null,null,null,null,null,null,null,null,null,null,null,null,"Unit 3",null,null,null,null,null,null,null,null,null,null,null,null,null,null,null,null,null,null,null,null,null,null,null,"Unit 12 - Land Navigation by Map and Compass",{"$f":"IF(COUNTIF(Certificate!$G$17:$G$21,EG10)>=1,\"\",ROW())","v":10},{"$f":"IF(ROW(EG10)-ROW(EG$2)+1>COUNT(EH$2:EH$10),\"\",INDEX(EG:EG,SMALL(EH$2:EH$10,1+ROW(EG10)-ROW(EG$2))))","v":"Unit 12 - Land Navigation by Map and Compass"}]
["Unit 14 - Photography Briefs",{"$f":"IF(COUNTIF(Certificate!$G$17:$G$21,A11)>=1,\"\",ROW())","v":11},"Unit 14 - Photography Briefs",null,"Unit 13 - Financial Planning and Forecasting",{"$f":"IF(COUNTIF(Certificate!$G$17:$G$21,E11)>=1,\"\",ROW())","v":11},"Unit 13 - Financial Planning and Forecasting",null,null,null,null,null,"Unit 14 - Exploring Wall and Floor Tiling Principles and Techniques",{"$f":"IF(COUNTIF(Certificate!$G$17:$G$21,M11)>=1,\"\",ROW())","v":11},"Unit 14 - Exploring Wall and Floor Tiling Principles and Techniques",null,null,null,null,null,"Unit 14 - Vehicle Engines and Other Systems",{"$f":"IF(COUNTIF(Certificate!$G$17:$G$21,U11)>=1,\"\",ROW())","v":11},"Unit 14 - Vehicle Engines and Other Systems",null,null,null,null,null,null,null,null,null,null,null,null,null,"Unit 13 - Website Development",{"$f":"IF(COUNTIF(Certificate!$G$17:$G$21,AK11)>=1,\"\",ROW())","v":11},"Unit 13 - Website Development",null,null,null,null,null,null,null,null,null,"Unit 18 - Jazz Dance Techniques",{"$f":"IF(COUNTIF(Certificate!$G$23:$G$25,AW11)>=1,\"\",ROW())","v":11},"Unit 18 - Jazz Dance Techniques",null,"Unit 18 - Jazz Dance Techniques",{"$f":"IF(COUNTIF(Certificate!$G$23:$G$25,BA11)>=1,\"\",ROW())","v":11},"Unit 18 - Jazz Dance Techniques",null,null,null,null,null,"Unit 25 - Sound for Performance",{"$f":"IF(COUNTIF(Certificate!$G$23:$G$25,BI11)>=1,\"\",ROW())","v":11},"Unit 25 - Sound for Performance",null,null,null,null,null,null,null,null,null,"Unit 28 - Make-up for Performance",{"$f":"IF(COUNTIF(Certificate!$G$23:$G$25,BU11)>=1,\"\",ROW())","v":11},"Unit 28 - Make-up for Performance",null,null,null,null,null,"Unit 24 - Lighting for Performance",{"$f":"IF(COUNTIF(Certificate!$G$23:$G$25,CC11)>=1,\"\",ROW())","v":11},"Unit 24 - Lighting for Performance",null,"Unit 29 - Wardrobe for Stage Performance",{"$f":"IF(COUNTIF(Certificate!$G$17:$G$19,CG11)>=1,\"\",ROW())","v":11},"Unit 29 - Wardrobe for Stage Performance",null,null,null,null,null,null,null,null,null,null,null,null,null,null,null,null,null,null,null,null,null,null,null,null,null,{"$f":"COUNTIF(Certificate!$G$17:$G$21,\"Unit 3 - Communicating Ideas in 2D\")","v":0}]
["Unit 15 - Designing for the Future",{"$f":"IF(COUNTIF(Certificate!$G$17:$G$21,A12)>=1,\"\",ROW())","v":12},"Unit 15 - Designing for the Future",null,"Unit 14 - Business Online",{"$f":"IF(COUNTIF(Certificate!$G$17:$G$21,E12)>=1,\"\",ROW())","v":12},"Unit 14 - Business Online",null,null,null,null,null,"Unit 15 - Exploring Plastering and Dry Lining Principles and Techniques",{"$f":"IF(COUNTIF(Certificate!$G$17:$G$21,M12)>=1,\"\",ROW())","v":12},"Unit 15 - Exploring Plastering and Dry Lining Principles and Techniques",null,null,null,null,null,null,null,null,null,null,null,null,null,null,null,null,null,null,null,null,null,"Unit 14 - Installing and Maintaining Computer Hardware",{"$f":"IF(COUNTIF(Certificate!$G$17:$G$21,AK12)>=1,\"\",ROW())","v":12},"Unit 14 - Installing and Maintaining Computer Hardware",null,null,null,null,null,null,null,null,null,"Unit 19 - Design Planning for Performance",{"$f":"IF(COUNTIF(Certificate!$G$23:$G$25,AW12)>=1,\"\",ROW())","v":12},"Unit 19 - Design Planning for Performance",null,"Unit 19 - Design Planning for Performance",{"$f":"IF(COUNTIF(Certificate!$G$23:$G$25,BA12)>=1,\"\",ROW())","v":12},"Unit 19 - Design Planning for Performance",null,null,null,null,null,"Unit 28 - Make-up for Performance",{"$f":"IF(COUNTIF(Certificate!$G$23:$G$25,BI12)>=1,\"\",ROW())","v":12},"Unit 28 - Make-up for Performance",null,null,null,null,null,null,null,null,null,"Unit 29 - Wardrobe for Stage Performance",{"$f":"IF(COUNTIF(Certificate!$G$23:$G$25,BU12)>=1,\"\",ROW())","v":12},"Unit 29 - Wardrobe for Stage Performance",null,null,null,null,null,"Unit 25 - Sound for Performance",{"$f":"IF(COUNTIF(Certificate!$G$23:$G$25,CC12)>=1,\"\",ROW())","v":12},"Unit 25 - Sound for Performance"]
[null,null,null,null,"Unit 15 - Public Sector Business",{"$f":"IF(COUNTIF(Certificate!$G$17:$G$21,E13)>=1,\"\",ROW())","v":13},"Unit 15 - Public Sector Business",null,null,null,null,null,null,null,null,null,null,null,null,null,null,null,null,null,null,null,null,null,null,null,null,null,null,null,null,null,"Unit 15 - Installing and Maintaining Computer Software",{"$f":"IF(COUNTIF(Certificate!$G$17:$G$21,AK13)>=1,\"\",ROW())","v":13},"Unit 15 - Installing and Maintaining Computer Software",null,null,null,null,null,null,null,null,null,"Unit 20 - Realising Costume Design for Performance",{"$f":"IF(COUNTIF(Certificate!$G$23:$G$25,AW13)>=1,\"\",ROW())","v":13},"Unit 20 - Realising Costume Design for Performance",null,"Unit 20 - Realising Costume Design for Performance",{"$f":"IF(COUNTIF(Certificate!$G$23:$G$25,BA13)>=1,\"\",ROW())","v":13},"Unit 20 - Realising Costume Design for Performance",null,null,null,null,null,"Unit 29 - Wardrobe for Stage Performance",{"$f":"IF(COUNTIF(Certificate!$G$23:$G$25,BI13)>=1,\"\",ROW())","v":13},"Unit 29 - Wardrobe for Stage Performance",null,null,null,null,null,null,null,null,null,null,null,null,null,null,null,null,null,"Unit 28 - Make-up for Performance",{"$f":"IF(COUNTIF(Certificate!$G$23:$G$25,CC13)>=1,\"\",ROW())","v":13},"Unit 28 - Make-up for Performance",null,null,null,null,null,null,null,null,null,null,null,null,null,null,null,null,null,null,null,null,null,null,null,null,null,null,null,null,null,"Unit 11"]
["Unit 3",null,null,null,null,null,null,null,null,null,null,null,null,null,null,null,null,null,null,null,null,null,null,null,null,null,null,null,null,null,null,null,null,null,null,null,"Unit 16 - Automated Computer Systems",{"$f":"IF(COUNTIF(Certificate!$G$17:$G$21,AK14)>=1,\"\",ROW())","v":14},"Unit 16 - Automated Computer Systems",null,null,null,null,null,null,null,null,null,"Unit 21 - Realising Set Design for Performance",{"$f":"IF(COUNTIF(Certificate!$G$23:$G$25,AW14)>=1,\"\",ROW())","v":14},"Unit 21 - Realising Set Design for Performance",null,"Unit 21 - Realising Set Design for Performance",{"$f":"IF(COUNTIF(Certificate!$G$23:$G$25,BA14)>=1,\"\",ROW())","v":14},"Unit 21 - Realising Set Design for Performance",null,null,null,null,null,null,null,null,null,null,null,null,null,null,null,null,null,null,null,null,null,null,null,null,null,"Unit 29 - Wardrobe for Stage Performance",{"$f":"IF(COUNTIF(Certificate!$G$23:$G$25,CC14)>=1,\"\",ROW())","v":14},"Unit 29 - Wardrobe for Stage Performance",null,null,null,null,null,null,null,null,null,null,null,null,null,null,null,null,null,null,null,null,null,null,null,null,null,null,null,null,null,{"$f":"COUNTIF(Certificate!$G$17:$G$21,\"Unit 11 - Graphic Design Briefs\")","v":0}]
[{"$f":"COUNTIF(Certificate!$G$17:$G$21,\"Unit 3 - Communicating Ideas in 2D\")","v":0},null,null,null,null,null,null,null,null,null,null,null,null,null,null,null,null,null,null,null,null,null,null,null,null,null,null,null,null,null,null,null,null,null,null,null,"Unit 17 - Multimedia Products Development",{"$f":"IF(COUNTIF(Certificate!$G$17:$G$21,AK15)>=1,\"\",ROW())","v":15},"Unit 17 - Multimedia Products Development",null,null,null,null,null,null,null,null,null,"Unit 22 - Realising Prop Design for Performance",{"$f":"IF(COUNTIF(Certificate!$G$23:$G$25,AW15)>=1,\"\",ROW())","v":15},"Unit 22 - Realising Prop Design for Performance",null,"Unit 22 - Realising Prop Design for Performance",{"$f":"IF(COUNTIF(Certificate!$G$23:$G$25,BA15)>=1,\"\",ROW())","v":15},"Unit 22 - Realising Prop Design for Performance"]
[null,null,null,null,{"$f":"Certificate!H27","v":0},null,null,null,null,null,null,null,null,null,null,null,null,null,null,null,null,null,null,null,null,null,null,null,null,null,null,null,null,null,null,null,null,null,null,null,null,null,null,null,null,null,null,null,"Unit 23 - Realising Mask Design for Performance",{"$f":"IF(COUNTIF(Certificate!$G$23:$G$25,AW16)>=1,\"\",ROW())","v":16},"Unit 23 - Realising Mask Design for Performance",null,"Unit 23 - Realising Mask Design for Performance",{"$f":"IF(COUNTIF(Certificate!$G$23:$G$25,BA16)>=1,\"\",ROW())","v":16},"Unit 23 - Realising Mask Design for Performance"]
["Unit 4",null,null,null,null,null,null,null,null,null,null,null,null,null,null,null,null,null,null,null,null,null,null,null,null,null,null,null,null,null,null,null,null,null,null,null,null,null,null,null,null,null,null,null,null,null,null,null,"Unit 24 - Lighting for Performance",{"$f":"IF(COUNTIF(Certificate!$G$23:$G$25,AW17)>=1,\"\",ROW())","v":17},"Unit 24 - Lighting for Performance",null,"Unit 24 - Lighting for Performance",{"$f":"IF(COUNTIF(Certificate!$G$23:$G$25,BA17)>=1,\"\",ROW())","v":17},"Unit 24 - Lighting for Performance"]
[{"$f":"COUNTIF(Certificate!$G$17:$G$21,\"Unit 4 - Communicating Ideas in 3D\")","v":0},null,null,null,null,null,null,null,null,null,null,null,null,null,null,null,null,null,null,null,null,null,null,null,null,null,null,null,null,null,null,null,null,null,null,null,null,null,null,null,null,null,null,null,null,null,null,null,"Unit 25 - Sound for Performance",{"$f":"IF(COUNTIF(Certificate!$G$23:$G$25,AW18)>=1,\"\",ROW())","v":18},"Unit 25 - Sound for Performance",null,"Unit 25 - Sound for Performance",{"$f":"IF(COUNTIF(Certificate!$G$23:$G$25,BA18)>=1,\"\",ROW())","v":18},"Unit 25 - Sound for Performance"]
[null,null,null,null,null,null,null,null,null,null,null,null,null,null,null,null,null,null,null,null,null,null,null,null,null,null,null,null,null,null,null,null,null,null,null,null,null,null,null,null,null,null,null,null,null,null,null,null,"Unit 26 - Supporting Performance: Stage Management",{"$f":"IF(COUNTIF(Certificate!$G$23:$G$25,AW19)>=1,\"\",ROW())","v":19},"Unit 26 - Supporting Performance: Stage Management",null,"Unit 26 - Supporting Performance: Stage Management",{"$f":"IF(COUNTIF(Certificate!$G$23:$G$25,BA19)>=1,\"\",ROW())","v":19},"Unit 26 - Supporting Performance: Stage Management"]
["Unit 9",null,null,null,null,null,null,null,null,null,null,null,null,null,null,null,null,null,null,null,null,null,null,null,null,null,null,null,null,null,null,null,null,null,null,null,null,null,null,null,null,null,null,null,null,null,null,null,"Unit 27 - Supporting Performance: Front of House",{"$f":"IF(COUNTIF(Certificate!$G$23:$G$25,AW20)>=1,\"\",ROW())","v":20},"Unit 27 - Supporting Performance: Front of House",null,"Unit 27 - Supporting Performance: Front of House",{"$f":"IF(COUNTIF(Certificate!$G$23:$G$25,BA20)>=1,\"\",ROW())","v":20},"Unit 27 - Supporting Performance: Front of House"]
[{"$f":"COUNTIF(Certificate!$G$17:$G$21,\"Unit 9 - Design Crafts Briefs\")","v":0},null,null,null,null,null,null,null,null,null,null,null,null,null,null,null,null,null,null,null,null,null,null,null,null,null,null,null,null,null,null,null,null,null,null,null,null,null,null,null,null,null,null,null,null,null,null,null,"Unit 28 - Make-up for Performance",{"$f":"IF(COUNTIF(Certificate!$G$23:$G$25,AW21)>=1,\"\",ROW())","v":21},"Unit 28 - Make-up for Performance",null,"Unit 28 - Make-up for Performance",{"$f":"IF(COUNTIF(Certificate!$G$23:$G$25,BA21)>=1,\"\",ROW())","v":21},"Unit 28 - Make-up for Performance"]
[null,null,null,null,null,null,null,null,null,null,null,null,null,null,null,null,null,null,null,null,null,null,null,null,null,null,null,null,null,null,null,null,null,null,null,null,null,null,null,null,null,null,null,null,null,null,null,null,"Unit 29 - Wardrobe for Stage Performance",{"$f":"IF(COUNTIF(Certificate!$G$23:$G$25,AW22)>=1,\"\",ROW())","v":22},"Unit 29 - Wardrobe for Stage Performance",null,"Unit 29 - Wardrobe for Stage Performance",{"$f":"IF(COUNTIF(Certificate!$G$23:$G$25,BA22)>=1,\"\",ROW())","v":22},"Unit 29 - Wardrobe for Stage Performance"]
["Unit 11"]
[{"$f":"COUNTIF(Certificate!$G$17:$G$21,\"Unit 11 - Graphic Design Briefs\")","v":0}]
[]
["Unit 13",null,"U"]
[{"$f":"COUNTIF(Certificate!$G$17:$G$21,\"Unit 13 - Visual Arts Briefs\")","v":0},null,"L1"]
[null,null,"P"]
[null,null,"M"]
[null,null,"D"]
[]
[]
[null,null,"Art and Design"]
[null,null,"Business"]
[null,null,"CPLD"]
[null,null,"Construction and the Built Environment"]
[null,null,"Creative Digital Media Production"]
[null,null,"Engineering"]
[null,null,"Health and Social Care"]
[null,null,"Hospitality"]
[null,null,"Music"]
[null,null,"Performing Arts"]
[null,null,"Sport"]
[null,null,"Travel and Tourism"]

{"sheet":"Extended Certificate","index":8,"n_rows":43,"n_cols":14,"rows_kept":43,"cut":false,"hidden":false,"merged":[[41,12,42,12],[6,7,6,8]]}
["Applied Science"]
["Art and Design",null,null,null,null,null,"Extended Certificate"]
["Art and Design Design Crafts"]
["Art and Design Fashion and Textiles"]
["Art and Design Photography",null,null,null,"Start ->","Select Sector"]
["Art and Design Product Design"]
["Art and Design Visual Arts",null,null,null,null,null,null,"360 GLH"]
["Art and Design Visual Communication",null,null,null,null,"Type","Unit","GLH","Grade",null,"Points",null,null,"ICT"]
["Business",null,null,null,"Core",{"$f":"IF(ISERROR(VLOOKUP(G9,'Ext Cert Unit Data'!B3:D26,3,FALSE)),\"\",VLOOKUP(G9,'Ext Cert Unit Data'!B3:D26,3,FALSE))","v":""},{"$f":"IF(ISERROR(VLOOKUP(G5,'Ext Cert Unit Data'!A3:B26,2,FALSE)),\"\",VLOOKUP(G5,'Ext Cert Unit Data'!A3:B26,2,FALSE))","v":""},{"$f":"IF(ISERROR(VLOOKUP(G9,'Ext Cert Unit Data'!B3:D26,2,FALSE)),\"\",VLOOKUP(G9,'Ext Cert Unit Data'!B3:D26,2,FALSE))","v":""},null,{"$f":"IF(I9=\"U\",0,IF(I9=\"L1\",2,IF(I9=\"P\",4,IF(I9=\"M\",6,IF(I9=\"D\",8)))))","v":false},{"$f":"IF(ISERROR(IF(I9=\"\",\"\",J9*(H9/10))),\"\",IF(I9=\"\",\"\",J9*(H9/10)))","v":""},null,{"$f":"IF(G5=\"Applied Science\",24,K9+K10)","v":{"$error":"#VALUE!"}},{"$f":"IF(K9>K10,K9,K10)","v":""}]
["Construction and the Built Environment",null,null,null,null,{"$f":"IF(ISERROR(VLOOKUP(G10,'Ext Cert Unit Data'!G3:I26,3,FALSE)),\"\",VLOOKUP(G10,'Ext Cert Unit Data'!G3:I26,3,FALSE))","v":""},{"$f":"IF(ISERROR(VLOOKUP(G5,'Ext Cert Unit Data'!F3:G26,2,FALSE)),\"\",VLOOKUP(G5,'Ext Cert Unit Data'!F3:G26,2,FALSE))","v":""},{"$f":"IF(ISERROR(VLOOKUP(G10,'Ext Cert Unit Data'!G3:I26,2,FALSE)),\"\",VLOOKUP(G10,'Ext Cert Unit Data'!G3:I26,2,FALSE))","v":""},null,{"$f":"IF(I10=\"U\",0,IF(I10=\"L1\",2,IF(I10=\"P\",4,IF(I10=\"M\",6,IF(I10=\"D\",8)))))","v":false},{"$f":"IF(ISERROR(IF(I10=\"\",\"\",J10*(H10/10))),\"\",IF(I10=\"\",\"\",J10*(H10/10)))","v":""},null,{"$f":"SUM(K9:K10,K12:K19,K21:K29,K31:K37,K39)","v":0},{"$f":"N9+K12","v":{"$error":"#VALUE!"}}]
["Creative Digital Media Production",null,null,null,null,null,null,null,null,null,null,null,{"$f":"IF(AND(M9<12),\"U\",IF(AND(M9<24,M9>11,M10<47),\"U\",IF(AND(M9<24,M9>11,M10>47),\"Level 1\",IF(AND(M9>23),M10))))","v":{"$error":"#VALUE!"}},{"$f":"IF(AND(N10<12),\"U\",IF(AND(N10<24,N10>11,M10>47),\"Level 1\",IF(AND(N10<24,N10>11,M10<47),\"U\",IF(AND(N10>23),M10))))","v":{"$error":"#VALUE!"}}]
["Engineering",null,null,null,{"$f":"IF(G5=\"Information and Creative Technology\",\"Core\",\"Mandatory\")","v":"Mandatory"},{"$f":"IF(ISERROR(VLOOKUP(G12,'Ext Cert Unit Data'!Q3:S27,3,FALSE)),\"\",VLOOKUP(G12,'Ext Cert Unit Data'!Q3:S27,3,FALSE))","v":""},{"$f":"IF(ISERROR(VLOOKUP(G5,'Ext Cert Unit Data'!P3:Q27,2,FALSE)),\"\",VLOOKUP(G5,'Ext Cert Unit Data'!P3:Q27,2,FALSE))","v":""},{"$f":"IF(ISERROR(VLOOKUP(G12,'Ext Cert Unit Data'!Q3:R27,2,FALSE)),\"\",VLOOKUP(G12,'Ext Cert Unit Data'!Q3:R27,2,FALSE))","v":""},null,{"$f":"IF(I12=\"U\",0,IF(I12=\"L1\",2,IF(I12=\"P\",4,IF(I12=\"M\",6,IF(I12=\"D\",8)))))","v":false},{"$f":"IF(ISERROR(IF(I12=\"\",\"\",J12*(H12/10))),\"\",IF(I12=\"\",\"\",J12*(H12/10)))","v":""},null,{"$f":"IF(ISERROR(IF(M11=\"U\",\"U\",IF(M11=\"Level 1\",\"Level 1\",VLOOKUP(M11,'Sheet1 (2)'!G2:H302,2,FALSE)))),\"\",IF(M11=\"U\",\"U\",IF(M11=\"Level 1\",\"Level 1\",VLOOKUP(M11,'Sheet1 (2)'!G2:H302,2,FALSE))))","v":""},{"$f":"IF(ISERROR(IF(N11=\"U\",\"U\",IF(N11=\"Level 1\",\"Level 1\",VLOOKUP(N11,'Sheet1 (2)'!G2:H302,2,FALSE)))),\"\",IF(N11=\"U\",\"U\",IF(N11=\"Level 1\",\"Level 1\",VLOOKUP(N11,'Sheet1 (2)'!G2:H302,2,FALSE))))","v":""}]
["Health and Social Care",null,null,null,null,{"$f":"IF(ISERROR(VLOOKUP(G13,'Ext Cert Unit Data'!Q30:S53,3,FALSE)),\"\",VLOOKUP(G13,'Ext Cert Unit Data'!Q30:S53,3,FALSE))","v":""},{"$f":"IF(ISERROR(VLOOKUP(G5,'Ext Cert Unit Data'!P31:Q53,2,FALSE)),\"\",VLOOKUP(G5,'Ext Cert Unit Data'!P31:Q53,2,FALSE))","v":""},{"$f":"IF(ISERROR(VLOOKUP(G13,'Ext Cert Unit Data'!Q30:R53,2,FALSE)),\"\",VLOOKUP(G13,'Ext Cert Unit Data'!Q30:R53,2,FALSE))","v":""},null,{"$f":"IF(I13=\"U\",0,IF(I13=\"L1\",2,IF(I13=\"P\",4,IF(I13=\"M\",6,IF(I13=\"D\",8)))))","v":false},{"$f":"IF(ISERROR(IF(I13=\"\",\"\",J13*(H13/10))),\"\",IF(I13=\"\",\"\",J13*(H13/10)))","v":""}]
["Hospitality",null,null,null,null,{"$f":"IF(ISERROR(VLOOKUP(G14,'Ext Cert Unit Data'!Q53:S86,3,FALSE)),\"\",VLOOKUP(G14,'Ext Cert Unit Data'!Q53:S86,3,FALSE))","v":""},{"$f":"IF(ISERROR(VLOOKUP(G5,'Ext Cert Unit Data'!P56:Q86,2,FALSE)),\"\",VLOOKUP(G5,'Ext Cert Unit Data'!P56:Q86,2,FALSE))","v":""},{"$f":"IF(ISERROR(VLOOKUP(G14,'Ext Cert Unit Data'!Q53:R86,2,FALSE)),\"\",VLOOKUP(G14,'Ext Cert Unit Data'!Q53:R86,2,FALSE))","v":""},null,{"$f":"IF(I14=\"U\",0,IF(I14=\"L1\",2,IF(I14=\"P\",4,IF(I14=\"M\",6,IF(I14=\"D\",8)))))","v":false},{"$f":"IF(ISERROR(IF(I14=\"\",\"\",J14*(H14/10))),\"\",IF(I14=\"\",\"\",J14*(H14/10)))","v":""}]
["Information and Creative Technology",null,null,null,null,{"$f":"IF(ISERROR(VLOOKUP(G15,'Ext Cert Unit Data'!Q94:S115,3,FALSE)),\"\",VLOOKUP(G15,'Ext Cert Unit Data'!Q94:S115,3,FALSE))","v":""},{"$f":"IF(ISERROR(VLOOKUP(G5,'Ext Cert Unit Data'!P93:Q115,2,FALSE)),\"\",VLOOKUP(G5,'Ext Cert Unit Data'!P93:Q115,2,FALSE))","v":""},{"$f":"IF(ISERROR(VLOOKUP(G15,'Ext Cert Unit Data'!Q94:R115,2,FALSE)),\"\",VLOOKUP(G15,'Ext Cert Unit Data'!Q94:R115,2,FALSE))","v":""},null,{"$f":"IF(I15=\"U\",0,IF(I15=\"L1\",2,IF(I15=\"P\",4,IF(I15=\"M\",6,IF(I15=\"D\",8)))))","v":false},{"$f":"IF(ISERROR(IF(I15=\"\",\"\",J15*(H15/10))),\"\",IF(I15=\"\",\"\",J15*(H15/10)))","v":""}]
["Music",null,null,null,null,{"$f":"IF(ISERROR(VLOOKUP(G16,'Ext Cert Unit Data'!Q117:S117,3,FALSE)),\"\",VLOOKUP(G16,'Ext Cert Unit Data'!Q117:S117,3,FALSE))","v":""},{"$f":"IF(ISERROR(VLOOKUP(G5,'Ext Cert Unit Data'!P117:Q117,2,FALSE)),\"\",VLOOKUP(G5,'Ext Cert Unit Data'!P117:Q117,2,FALSE))","v":""},{"$f":"IF(ISERROR(VLOOKUP(G16,'Ext Cert Unit Data'!Q117:R117,2,FALSE)),\"\",VLOOKUP(G16,'Ext Cert Unit Data'!Q117:R117,2,FALSE))","v":""},null,false,{"$f":"IF(ISERROR(IF(I16=\"\",\"\",J16*(H16/10))),\"\",IF(I16=\"\",\"\",J16*(H16/10)))","v":""}]
["Performing Arts",null,null,null,null,{"$f":"IF(ISERROR(VLOOKUP(G17,'Ext Cert Unit Data'!Q125:S125,3,FALSE)),\"\",VLOOKUP(G17,'Ext Cert Unit Data'!Q125:S125,3,FALSE))","v":""},{"$f":"IF(ISERROR(VLOOKUP(G5,'Ext Cert Unit Data'!P125:Q125,2,FALSE)),\"\",VLOOKUP(G5,'Ext Cert Unit Data'!P125:Q125,2,FALSE))","v":""},{"$f":"IF(ISERROR(VLOOKUP(G17,'Ext Cert Unit Data'!Q125:R125,2,FALSE)),\"\",VLOOKUP(G17,'Ext Cert Unit Data'!Q125:R125,2,FALSE))","v":""},null,false,{"$f":"IF(ISERROR(IF(I17=\"\",\"\",J17*(H17/10))),\"\",IF(I17=\"\",\"\",J17*(H17/10)))","v":""}]
["Performing Arts Acting",null,null,null,null,{"$f":"IF(ISERROR(VLOOKUP(G18,'Ext Cert Unit Data'!Q128:S128,3,FALSE)),\"\",VLOOKUP(G18,'Ext Cert Unit Data'!Q128:S128,3,FALSE))","v":""},{"$f":"IF(ISERROR(VLOOKUP(G5,'Ext Cert Unit Data'!P128:Q128,2,FALSE)),\"\",VLOOKUP(G5,'Ext Cert Unit Data'!P128:Q128,2,FALSE))","v":""},{"$f":"IF(ISERROR(VLOOKUP(G18,'Ext Cert Unit Data'!Q128:R128,2,FALSE)),\"\",VLOOKUP(G18,'Ext Cert Unit Data'!Q128:R128,2,FALSE))","v":""},null,{"$f":"IF(I18=\"U\",0,IF(I18=\"L1\",2,IF(I18=\"P\",4,IF(I18=\"M\",6,IF(I18=\"D\",8)))))","v":false},{"$f":"IF(ISERROR(IF(I18=\"\",\"\",J18*(H18/10))),\"\",IF(I18=\"\",\"\",J18*(H18/10)))","v":""}]
["Performing Arts Dance",null,null,null,null,{"$f":"IF(ISERROR(VLOOKUP(G19,'Ext Cert Unit Data'!Q130:S130,3,FALSE)),\"\",VLOOKUP(G19,'Ext Cert Unit Data'!Q130:S130,3,FALSE))","v":""},{"$f":"IF(ISERROR(VLOOKUP(G5,'Ext Cert Unit Data'!P130:Q130,2,FALSE)),\"\",VLOOKUP(G5,'Ext Cert Unit Data'!P130:Q130,2,FALSE))","v":""},{"$f":"IF(ISERROR(VLOOKUP(G19,'Ext Cert Unit Data'!Q130:R130,2,FALSE)),\"\",VLOOKUP(G19,'Ext Cert Unit Data'!Q130:R130,2,FALSE))","v":""},null,{"$f":"IF(I14=\"U\",0,IF(I14=\"L1\",2,IF(I14=\"P\",4,IF(I14=\"M\",6,IF(I14=\"D\",8)))))","v":false},{"$f":"IF(ISERROR(IF(I19=\"\",\"\",J19*(H19/10))),\"\",IF(I19=\"\",\"\",J19*(H19/10)))","v":""}]
["Performing Arts Production"]
["Public Services",null,null,null,{"$f":"IF(OR(G5=\"Creative Digital Media Production\",G5=\"Hospitality\",G5=\"Music\",G5=\"Performing Arts Acting\",G5=\"Performing Arts Dance\",G5=\"Performing Arts Musical Theatre\",G5=\"Performing Arts Production\",G5=\"\"),\"Optional A\", \"Optional\")","v":"Optional A"},{"$f":"IF(ISERROR(VLOOKUP(G21,'Ext Cert Unit Data'!$V$3:$X$242,3,FALSE)),\"\",VLOOKUP(G21,'Ext Cert Unit Data'!$V$3:$X$242,3,FALSE))","v":""},null,{"$f":"IF(ISERROR(VLOOKUP(G21,'Ext Cert Unit Data'!$V$3:$W$242,2,FALSE)),\"\",VLOOKUP(G21,'Ext Cert Unit Data'!$V$3:$W$242,2,FALSE))","v":""},null,{"$f":"IF(I21=\"U\",0,IF(I21=\"L1\",2,IF(I21=\"P\",4,IF(I21=\"M\",6,IF(I21=\"D\",8)))))","v":false},{"$f":"IF(ISERROR(IF(I21=\"\",\"\",J21*(H21/10))),\"\",IF(I21=\"\",\"\",J21*(H21/10)))","v":""}]
["Sport",null,null,null,null,{"$f":"IF(ISERROR(VLOOKUP(G22,'Ext Cert Unit Data'!$V$3:$X$242,3,FALSE)),\"\",VLOOKUP(G22,'Ext Cert Unit Data'!$V$3:$X$242,3,FALSE))","v":""},null,{"$f":"IF(ISERROR(VLOOKUP(G22,'Ext Cert Unit Data'!$V$3:$W$242,2,FALSE)),\"\",VLOOKUP(G22,'Ext Cert Unit Data'!$V$3:$W$242,2,FALSE))","v":""},null,{"$f":"IF(I22=\"U\",0,IF(I22=\"L1\",2,IF(I22=\"P\",4,IF(I22=\"M\",6,IF(I22=\"D\",8)))))","v":false},{"$f":"IF(ISERROR(IF(I22=\"\",\"\",J22*(H22/10))),\"\",IF(I22=\"\",\"\",J22*(H22/10)))","v":""},null,{"$f":"IF(G49<>\"\",2,1)","v":1}]
["Travel and Tourism",null,null,null,null,{"$f":"IF(ISERROR(VLOOKUP(G23,'Ext Cert Unit Data'!$V$3:$X$242,3,FALSE)),\"\",VLOOKUP(G23,'Ext Cert Unit Data'!$V$3:$X$242,3,FALSE))","v":""},null,{"$f":"IF(ISERROR(VLOOKUP(G23,'Ext Cert Unit Data'!$V$3:$W$242,2,FALSE)),\"\",VLOOKUP(G23,'Ext Cert Unit Data'!$V$3:$W$242,2,FALSE))","v":""},null,{"$f":"IF(I23=\"U\",0,IF(I23=\"L1\",2,IF(I23=\"P\",4,IF(I23=\"M\",6,IF(I23=\"D\",8)))))","v":false},{"$f":"IF(ISERROR(IF(I23=\"\",\"\",J23*(H23/10))),\"\",IF(I23=\"\",\"\",J23*(H23/10)))","v":""}]
[null,null,null,null,null,{"$f":"IF(ISERROR(VLOOKUP(G24,'Ext Cert Unit Data'!$V$3:$X$242,3,FALSE)),\"\",VLOOKUP(G24,'Ext Cert Unit Data'!$V$3:$X$242,3,FALSE))","v":""},null,{"$f":"IF(ISERROR(VLOOKUP(G24,'Ext Cert Unit Data'!$V$3:$W$242,2,FALSE)),\"\",VLOOKUP(G24,'Ext Cert Unit Data'!$V$3:$W$242,2,FALSE))","v":""},null,{"$f":"IF(I24=\"U\",0,IF(I24=\"L1\",2,IF(I24=\"P\",4,IF(I24=\"M\",6,IF(I24=\"D\",8)))))","v":false},{"$f":"IF(ISERROR(IF(I24=\"\",\"\",J24*(H24/10))),\"\",IF(I24=\"\",\"\",J24*(H24/10)))","v":""}]
[null,null,null,null,null,{"$f":"IF(ISERROR(VLOOKUP(G25,'Ext Cert Unit Data'!$V$3:$X$242,3,FALSE)),\"\",VLOOKUP(G25,'Ext Cert Unit Data'!$V$3:$X$242,3,FALSE))","v":""},null,{"$f":"IF(ISERROR(VLOOKUP(G25,'Ext Cert Unit Data'!$V$3:$W$242,2,FALSE)),\"\",VLOOKUP(G25,'Ext Cert Unit Data'!$V$3:$W$242,2,FALSE))","v":""},null,{"$f":"IF(I25=\"U\",0,IF(I25=\"L1\",2,IF(I25=\"P\",4,IF(I25=\"M\",6,IF(I25=\"D\",8)))))","v":false},{"$f":"IF(ISERROR(IF(I25=\"\",\"\",J25*(H25/10))),\"\",IF(I25=\"\",\"\",J25*(H25/10)))","v":""}]
[null,null,null,null,null,{"$f":"IF(ISERROR(VLOOKUP(G26,'Ext Cert Unit Data'!$V$3:$X$242,3,FALSE)),\"\",VLOOKUP(G26,'Ext Cert Unit Data'!$V$3:$X$242,3,FALSE))","v":""},null,{"$f":"IF(ISERROR(VLOOKUP(G26,'Ext Cert Unit Data'!$V$3:$W$242,2,FALSE)),\"\",VLOOKUP(G26,'Ext Cert Unit Data'!$V$3:$W$242,2,FALSE))","v":""},null,false,{"$f":"IF(ISERROR(IF(I26=\"\",\"\",J26*(H26/10))),\"\",IF(I26=\"\",\"\",J26*(H26/10)))","v":""}]
[null,null,null,null,null,{"$f":"IF(ISERROR(VLOOKUP(G27,'Ext Cert Unit Data'!$V$3:$X$242,3,FALSE)),\"\",VLOOKUP(G27,'Ext Cert Unit Data'!$V$3:$X$242,3,FALSE))","v":""},null,{"$f":"IF(ISERROR(VLOOKUP(G27,'Ext Cert Unit Data'!$V$3:$W$242,2,FALSE)),\"\",VLOOKUP(G27,'Ext Cert Unit Data'!$V$3:$W$242,2,FALSE))","v":""},null,false,""]
[null,null,null,null,null,{"$f":"IF(ISERROR(VLOOKUP(G28,'Ext Cert Unit Data'!$V$3:$X$242,3,FALSE)),\"\",VLOOKUP(G28,'Ext Cert Unit Data'!$V$3:$X$242,3,FALSE))","v":""},null,{"$f":"IF(ISERROR(VLOOKUP(G28,'Ext Cert Unit Data'!$V$3:$W$242,2,FALSE)),\"\",VLOOKUP(G28,'Ext Cert Unit Data'!$V$3:$W$242,2,FALSE))","v":""},null,false,""]
[null,null,null,null,null,{"$f":"IF(ISERROR(VLOOKUP(G29,'Ext Cert Unit Data'!$V$3:$X$242,3,FALSE)),\"\",VLOOKUP(G29,'Ext Cert Unit Data'!$V$3:$X$242,3,FALSE))","v":""},null,{"$f":"IF(ISERROR(VLOOKUP(G29,'Ext Cert Unit Data'!$V$3:$W$242,2,FALSE)),\"\",VLOOKUP(G29,'Ext Cert Unit Data'!$V$3:$W$242,2,FALSE))","v":""},null,false,""]
[]
[null,null,null,null,"Optional B",{"$f":"IF(ISERROR(VLOOKUP(G31,'Ext Cert Unit Data'!$V$3:$X$242,3,FALSE)),\"\",VLOOKUP(G31,'Ext Cert Unit Data'!$V$3:$X$242,3,FALSE))","v":""},null,{"$f":"IF(ISERROR(VLOOKUP(G31,'Ext Cert Unit Data'!$V$3:$X$242,2,FALSE)),\"\",VLOOKUP(G31,'Ext Cert Unit Data'!$V$3:$X$242,2,FALSE))","v":""},null,{"$f":"IF(I31=\"U\",0,IF(I31=\"L1\",2,IF(I31=\"P\",4,IF(I31=\"M\",6,IF(I31=\"D\",8)))))","v":false},{"$f":"IF(ISERROR(IF(I31=\"\",\"\",J31*(H31/10))),\"\",IF(I31=\"\",\"\",J31*(H31/10)))","v":""}]
[null,null,null,null,null,{"$f":"IF(ISERROR(VLOOKUP(G32,'Ext Cert Unit Data'!$V$3:$X$242,3,FALSE)),\"\",VLOOKUP(G32,'Ext Cert Unit Data'!$V$3:$X$242,3,FALSE))","v":""},null,{"$f":"IF(ISERROR(VLOOKUP(G32,'Ext Cert Unit Data'!$V$3:$X$242,2,FALSE)),\"\",VLOOKUP(G32,'Ext Cert Unit Data'!$V$3:$X$242,2,FALSE))","v":""},null,false,""]
[null,null,null,null,null,{"$f":"IF(ISERROR(VLOOKUP(G33,'Ext Cert Unit Data'!$V$3:$X$242,3,FALSE)),\"\",VLOOKUP(G33,'Ext Cert Unit Data'!$V$3:$X$242,3,FALSE))","v":""},null,{"$f":"IF(ISERROR(VLOOKUP(G33,'Ext Cert Unit Data'!$V$3:$X$242,2,FALSE)),\"\",VLOOKUP(G33,'Ext Cert Unit Data'!$V$3:$X$242,2,FALSE))","v":""},null,false,""]
[null,null,null,null,null,{"$f":"IF(ISERROR(VLOOKUP(G34,'Ext Cert Unit Data'!$V$3:$X$242,3,FALSE)),\"\",VLOOKUP(G34,'Ext Cert Unit Data'!$V$3:$X$242,3,FALSE))","v":""},null,{"$f":"IF(ISERROR(VLOOKUP(G34,'Ext Cert Unit Data'!$V$3:$X$242,2,FALSE)),\"\",VLOOKUP(G34,'Ext Cert Unit Data'!$V$3:$X$242,2,FALSE))","v":""},null,false,""]
[null,null,null,null,null,{"$f":"IF(ISERROR(VLOOKUP(G35,'Ext Cert Unit Data'!$V$3:$X$242,3,FALSE)),\"\",VLOOKUP(G35,'Ext Cert Unit Data'!$V$3:$X$242,3,FALSE))","v":""},null,{"$f":"IF(ISERROR(VLOOKUP(G35,'Ext Cert Unit Data'!$V$3:$X$242,2,FALSE)),\"\",VLOOKUP(G35,'Ext Cert Unit Data'!$V$3:$X$242,2,FALSE))","v":""},null,false,""]
[null,null,null,null,null,{"$f":"IF(ISERROR(VLOOKUP(G36,'Ext Cert Unit Data'!$V$3:$X$242,3,FALSE)),\"\",VLOOKUP(G36,'Ext Cert Unit Data'!$V$3:$X$242,3,FALSE))","v":""},null,{"$f":"IF(ISERROR(VLOOKUP(G36,'Ext Cert Unit Data'!$V$3:$X$242,2,FALSE)),\"\",VLOOKUP(G36,'Ext Cert Unit Data'!$V$3:$X$242,2,FALSE))","v":""},null,false,""]
[null,null,null,null,null,{"$f":"IF(ISERROR(VLOOKUP(G37,'Ext Cert Unit Data'!$V$3:$X$242,3,FALSE)),\"\",VLOOKUP(G37,'Ext Cert Unit Data'!$V$3:$X$242,3,FALSE))","v":""},null,{"$f":"IF(ISERROR(VLOOKUP(G37,'Ext Cert Unit Data'!$V$3:$X$242,2,FALSE)),\"\",VLOOKUP(G37,'Ext Cert Unit Data'!$V$3:$X$242,2,FALSE))","v":""},null,false,""]
[null,null,null,null,null,null,null,null,null,null,{"$f":"IF(ISERROR(IF(I38=\"\",\"\",J38*(H38/10))),\"\",IF(I38=\"\",\"\",J38*(H38/10)))","v":""}]
[null,null,null,null,"Optional C",{"$f":"IF(ISERROR(VLOOKUP(G39,'Ext Cert Unit Data'!$V$3:$X$242,3,FALSE)),\"\",VLOOKUP(G39,'Ext Cert Unit Data'!$V$3:$X$242,3,FALSE))","v":""},null,{"$f":"IF(ISERROR(VLOOKUP(G39,'Ext Cert Unit Data'!$V$3:$X$242,2,FALSE)),\"\",VLOOKUP(G39,'Ext Cert Unit Data'!$V$3:$X$242,2,FALSE))","v":""},null,{"$f":"IF(I39=\"U\",0,IF(I39=\"L1\",2,IF(I39=\"P\",4,IF(I39=\"M\",6,IF(I39=\"D\",8)))))","v":false},{"$f":"IF(ISERROR(IF(I39=\"\",\"\",J39*(H39/10))),\"\",IF(I39=\"\",\"\",J39*(H39/10)))","v":""}]
[null,null,null,null,null,null,null,{"$f":"SUM(H9:H39)","v":0}]
[]
[null,null,null,null,null,null,null,null," Points",null,{"$f":"SUM(K9:K39)","v":0},"'Alert box Hospitality prerequisites",{"$f":"IF(ISERROR(IF($G$5=\"Application of Science\", \"\", IF($K9+$K10<24,\"24 points across Core Units required to achieve Level 2\",\"\"))),\"\",IF($G$5=\"Application of Science\", \"\", IF($K9+$K10<24,\"24 points across Core Units required to achieve Level 2\",\"\")))","v":""}]
[null,null,null,null,null,null,null,null," Grade",null,{"$f":"IF(G5=\"\",\"\",IF(G5=\"Information and Creative Technology\",N12,M12))","v":""},{"$f":"IF(H40>240,1,IF(H40<240,3,2))","v":3}]

{"sheet":"Ext Cert Unit Data","index":9,"n_rows":242,"n_cols":24,"rows_kept":242,"cut":false,"hidden":true,"merged":[]}
["Core Units",null,null,null,null,null,null,null,null,null,null,null,null,null,null,"Mandatory Units",null,null,null,null,"Ext Certificate Units"]
["Sector","Unit Name","GLH",null,null,"Sector","Unit Name","GLH",null,null,"Sector","Unit Name","GLH",null,null,"Sector","Unit Name","GLH",null,null,"Sector","Unit Name","GLH"]
["Art and Design","Unit 1 - Introduction to Specialist Pathways in Art and Design",30,"Internal",null,"Art and Design","Unit 2 - Creative Project in Art and Design",30,"External",null,"Art and Design","Unit 23 - Practical Research Project in Art and Design",60,"External",null,"Art and Design","Unit 5 - Developing an Art and Design Portfolio",30,"Internal",null,"Art and Design","Unit 3 - Communicating Ideas in 2D",30,"Internal"]
["Art and Design Design Crafts","Unit 1 - Introduction to Specialist Pathways in Art and Design",30,"Internal",null,"Art and Design Design Crafts","Unit 2 - Creative Project in Art and Design",30,"External",null,"Art and Design Design Crafts","Unit 23 - Practical Research Project in Art and Design",60,"Internal",null,"Art and Design Design Crafts","Unit 5 - Developing an Art and Design Portfolio",30,"Internal",null,"Art and Design","Unit 4 - Communicating Ideas in 3D",30,"Internal"]
["Art and Design Fashion and Textiles","Unit 1 - Introduction to Specialist Pathways in Art and Design",30,"Internal",null,"Art and Design Fashion and Textiles","Unit 2 - Creative Project in Art and Design",30,"External",null,"Art and Design Fashion and Textiles","Unit 23 - Practical Research Project in Art and Design",60,"Internal",null,"Art and Design Fashion and Textiles","Unit 5 - Developing an Art and Design Portfolio",30,"Internal",null,"Art and Design","Unit 5 - Developing an Art and Design Portfolio",30,"Internal"]
["Art and Design Photography","Unit 1 - Introduction to Specialist Pathways in Art and Design",30,"Internal",null,"Art and Design Photography","Unit 2 - Creative Project in Art and Design",30,"External",null,"Art and Design Photography","Unit 23 - Practical Research Project in Art and Design",60,"Internal",null,"Art and Design Photography","Unit 5 - Developing an Art and Design Portfolio",30,"Internal",null,"Art and Design","Unit 6 - Investigating Contextual References in Art and Design",30,"Internal"]
["Art and Design Product Design","Unit 1 - Introduction to Specialist Pathways in Art and Design",30,"Internal",null,"Art and Design Product Design","Unit 2 - Creative Project in Art and Design",30,"External",null,"Art and Design Product Design","Unit 23 - Practical Research Project in Art and Design",60,"Internal",null,"Art and Design Product Design","Unit 5 - Developing an Art and Design Portfolio",30,"Internal",null,"Art and Design","Unit 7 - Recording for Creative Intentions in Art and Design",30,"External"]
["Art and Design Visual Arts","Unit 1 - Introduction to Specialist Pathways in Art and Design",30,"Internal",null,"Art and Design Visual Arts","Unit 2 - Creative Project in Art and Design",30,"External",null,"Art and Design Visual Arts","Unit 23 - Practical Research Project in Art and Design",60,"Internal",null,"Art and Design Visual Arts","Unit 5 - Developing an Art and Design Portfolio",30,"Internal",null,"Art and Design","Unit 8 - Using Mobile Devices in Art and Design",30,"Internal"]
["Art and Design Visual Communication","Unit 1 - Introduction to Specialist Pathways in Art and Design",30,"Internal",null,"Art and Design Visual Communication","Unit 2 - Creative Project in Art and Design",30,"External",null,"Art and Design Visual Communication","Unit 23 - Practical Research Project in Art and Design",60,"Internal",null,"Art and Design Visual Communication","Unit 5 - Developing an Art and Design Portfolio",30,"Internal",null,"Art and Design","Unit 9 - Design Crafts Briefs",60,"Internal"]
["Business","Unit 1 - Enterprise in the Business World",30,"Internal",null,"Business","Unit 2 - Finance for Business",30,"External",null,"Business",null,30,"External",null,"Business","Unit 9 - Principles of Marketing",30,"External",null,"Art and Design","Unit 10 - Fashion Briefs",60,"Internal"]
["CPLD","Unit 1 - Patterns of Child Development",30,"External",null,"CPLD","Unit 2 - Promoting Children’s Development Through Play",30,"Internal",null,"CPLD",null,30,"Internal",null,"CPLD","Unit 3 - The Principles of Early Years Practice",60,"Internal",null,"Art and Design","Unit 11 - Graphic Design Briefs",60,"Internal"]
["Construction and the Built Environment","Unit 1 - Construction Technology ",30,"External",null,"Construction and the Built Environment","Unit 2 - Construction Technology ",30,"Internal",null,"Construction and the Built Environment",null,30,"Internal",null,"Construction and the Built Environment","Unit 3 - Scientific and Mathematical Applications for Construction",30,"Internal",null,"Art and Design","Unit 12 - Textiles Briefs",60,"Internal"]
["Creative Digital Media Production","Unit 1 - Digital Media Sectors and Audiences",30,"External",null,"Creative Digital Media Production","Unit 2 - Planning and Pitching a Digital Media Product ",30,"Internal",null,"Creative Digital Media Production",null,30,"Internal",null,"Creative Digital Media Production","Unit 8 - Media Industry in Context",30,"External",null,"Art and Design","Unit 13 - Visual Arts Briefs",60,"Internal"]
["Engineering","Unit 1 - The Engineered World",30,"External",null,"Engineering","Unit 2 - Investigating an Engineered Product ",30,"Internal",null,"Engineering",null,30,"Internal",null,"Engineering","Unit 9 - Interpreting and Using Engineering Information",30,"External",null,"Art and Design","Unit 14 - Photography Briefs",60,"Internal"]
["Health and Social Care","Unit 1 - Human Lifespan Development",30,"External",null,"Health and Social Care","Unit 2 - Health and Social Care Values",30,"Internal",null,"Health and Social Care",null,30,"Internal",null,"Health and Social Care","Unit 3 - Effective Communication in Health and Social Care",30,"Internal",null,"Art and Design","Unit 15 - Designing for the Future",60,"Internal"]
["Hospitality","Unit 1 - Introducing the Hospitality Industry",30,"External",null,"Hospitality","Unit 2 - Working in the Hospitality Industry",30,"Internal",null,"Hospitality",null,30,"Internal",null,"Hospitality","Unit 3 - Food Safety and Health and Safety in Hospitality",30,"Internal",null,"Art and Design","Unit 16 - Applying Contextual References in Art and Design",30,"Internal"]
["Information and Creative Technology","Unit 1 - The Online World",30,"External",null,"Information and Creative Technology","Unit 2 - Technology Systems",30,"External",null,"Information and Creative Technology",null,30,"External",null,"Information and Creative Technology","Unit 3 - A Digital Portfolio",30,"Internal",null,"Art and Design","Unit 17 - Art, Craft and Design in the Creative Industries",30,"Internal"]
["Music","Unit 1 - The Music Industry",30,"External",null,"Music","Unit 2 - Managing a Music Product ",30,"Internal",null,"Music",null,30,"Internal",null,"Music","Unit 8 - Music and Production Analysis",30,"External",null,"Art and Design","Unit 18 - 3D Design Briefs",60,"Internal"]
["Performing Arts","Unit 1 - Individual Showcase ",30,"External",null,"Performing Arts","Unit 2 - Preparation, Performance and Production ",30,"Internal",null,"Performing Arts",null,30,"Internal",null,"Performing Arts","Unit 8 - The Performing Arts Industry ",30,"External",null,"Art and Design","Unit 19 - Digital Art and Design Briefs",60,"Internal"]
["Performing Arts Acting","Unit 1 - Individual Showcase ",30,"External",null,"Performing Arts Acting","Unit 2 - Preparation, Performance and Production ",30,"Internal",null,"Performing Arts Acting",null,30,"Internal",null,"Public Services","Unit 6 - Citizenship, Society and the Public Services",30,"External",null,"Art and Design","Unit 20 - Interactive Media Production Briefs",60,"Internal"]
["Performing Arts Dance","Unit 1 - Individual Showcase ",30,"External",null,"Performing Arts Dance","Unit 2 - Preparation, Performance and Production ",30,"Internal",null,"Performing Arts Dance",null,30,"Internal",null,"Performing Arts Acting","Unit 3 - Acting Skills",60,"Internal",null,"Art and Design","Unit 21 - Painting Briefs",60,"Internal"]
["Performing Arts Musical Theatre","Unit 1 - Individual Showcase ",30,"External",null,"Performing Arts Musical Theatre","Unit 2 - Preparation, Performance and Production ",30,"Internal",null,"Performing Arts Musical Theatre",null,30,"Internal",null,"Performing Arts Dance","Unit 4 - Dance Skills",60,"Internal",null,"Art and Design","Unit 22 - Designing Products",60,"Internal"]
["Performing Arts Production","Unit 1 - Individual Showcase ",30,"External",null,"Performing Arts Production","Unit 2 - Preparation, Performance and Production ",30,"Internal",null,"Performing Arts Production",null,30,"Internal",null,"Performing Arts Musical Theatre","Unit 5 - Musical Theatre Skills",60,"Internal",null,"Art and Design","Unit 24 - Design Thinking",60,"Internal"]
["Sport","Unit 1 - Fitness for Sport and Exercise",30,"External",null,"Sport","Unit 2 - Practical Sports Performance ",30,"Internal",null,"Sport",null,30,"Internal",null,"Performing Arts Production","Unit 7 - Production Skills for Performance",60,"Internal",null,"Art and Design","Unit 25 - Fashion Promotion",60,"Internal"]
["Travel and Tourism","Unit 1 - The UK Travel and Tourism Sector",30,"External",null,"Travel and Tourism","Unit 2 - UK Travel and Tourism Destinations ",30,"Internal",null,"Travel and Tourism",null,30,"Internal",null,"Sport","Unit 7 - Anatomy and Physiology for Sports Performance",30,"External",null,"Art and Design","Unit 26 - Moving Image Briefs",60,"Internal"]
["Public Services","Unit 1 - The Role and Work of the Public Services",30,"External",null,"Public Services","Unit 2 - Working Skills in the Public Service Sector",30,"Internal",null,"Public Services",null,30,"Internal",null,"Travel and Tourism","Unit 4 - International Travel and Tourism Destinations ",30,"Internal",null,"Art and Design","Unit 27 - Interaction Design",60,"Internal"]
[null,null,null,null,null,null,null,null,null,null,null,null,null,null,null,"Applied Science","Unit 1 - Principles of Science",30,"External",null,"Art and Design","Unit 28 - Printmaking Briefs",60,"Internal"]
[null,null,null,null,null,null,null,null,null,null,null,null,null,null,null,null,null,null,null,null,"Art and Design","Unit 29 - Drawing from Observation",60,"Internal"]
[null,null,null,null,null,null,null,null,null,null,null,null,null,null,null,null,null,null,null,null,"Art and Design","Unit 30 - Ceramics",60,"Internal"]
[null,null,null,null,null,null,null,null,null,null,null,null,null,null,null,null,null,null,null,null,"Art and Design","Unit 31 - Studio Photography",60,"Internal"]
[null,null,null,null,null,null,null,null,null,null,null,null,null,null,null,"Applied Science","Unit 2 - Chemistry and our Earth",30,"Internal",null,"Art and Design","Unit 32 - Location Photography",60,"Internal"]
[null,null,null,null,null,null,null,null,null,null,null,null,null,null,null,"Art and Design","Unit 6 - Investigating Contextual References in Art and Design ",30,"Internal",null,"Art and Design","Unit 33 - Designing for Print and Screen",60,"Internal"]
[null,null,null,null,null,null,null,null,null,null,null,null,null,null,null,"Art and Design Design Crafts","Unit 6 - Investigating Contextual References in Art and Design ",30,"Internal",null,"Art and Design","Unit 34 - Editing Photographic Images",60,"Internal"]
[null,null,null,null,null,null,null,null,null,null,null,null,null,null,null,"Art and Design Fashion and Textiles","Unit 6 - Investigating Contextual References in Art and Design ",30,"Internal",null,"Art and Design","Unit 35 - Fashion Retail",60,"Internal"]
[null,null,null,null,null,null,null,null,null,null,null,null,null,null,null,"Art and Design Photography","Unit 6 - Investigating Contextual References in Art and Design ",30,"Internal",null,"Art and Design","Unit 36 - Surface Design",60,"Internal"]
[null,null,null,null,null,null,null,null,null,null,null,null,null,null,null,"Art and Design Product Design","Unit 6 - Investigating Contextual References in Art and Design ",30,"Internal",null,"Art and Design","Unit 37 - Sustainability in Art and Design Practice",30,"Internal"]
[null,null,null,null,null,null,null,null,null,null,null,null,null,null,null,"Art and Design Visual Arts","Unit 6 - Investigating Contextual References in Art and Design ",30,"Internal",null,"Art and Design","Unit 38 - Advertising Briefs",60,"Internal"]
[null,null,null,null,null,null,null,null,null,null,null,null,null,null,null,"Art and Design Visual Communication","Unit 6 - Investigating Contextual References in Art and Design ",30,"Internal",null,"Art and Design","Unit 39 - Modelmaking",60,"Internal"]
[null,null,null,null,null,null,null,null,null,null,null,null,null,null,null,null,null," "," ",null,"Art and Design","Unit 40 - Sculpture",60,"Internal"]
[null,null,null,null,null,null,null,null,null,null,null,null,null,null,null,"CPLD","Unit 4 - Promoting Children’s Positive Behaviour",30,"External",null,"Business","Unit 3 - Promoting a Brand",30,"Internal"]
[null,null,null,null,null,null,null,null,null,null,null,null,null,null,null,"Construction and the Built Environment","Unit 11 - Sustainability in Construction",30,"External",null,"Business","Unit 4 - Principles of Customer Service",30,"Internal"]
[null,null,null,null,null,null,null,null,null,null,null,null,null,null,null,"Creative Digital Media Production",null,null,null,null,"Business","Unit 5 - Sales and Personal Selling",30,"Internal"]
[null,null,null,null,null,null,null,null,null,null,null,null,null,null,null,"Engineering","Unit 10 - Mathematics for Engineering",30,"Internal",null,"Business","Unit 6 - Introducing Retail Business",30,"Internal"]
[null,null,null,null,null,null,null,null,null,null,null,null,null,null,null,"Health and Social Care","Unit 9 - Healthy Living ",30,"External",null,"Business","Unit 7 - Providing Business Support",30,"Internal"]
[null,null,null,null,null,null,null,null,null,null,null,null,null,null,null,"Hospitality","Unit 9 - How the Hospitality Industry Contributes to Healthy Lifestyles",30,"External",null,"Business","Unit 8 - Recruitment, Selection and Employment",30,"Internal"]
[null,null,null,null,null,null,null,null,null,null,null,null,null,null,null,null,null,null," ",null,"Business","Unit 10 - Using Business Documentation",30,"Internal"]
[null,null,null,null,null,null,null,null,null,null,null,null,null,null,null,"Music","Unit 16 - Music Showcase",30,"Internal",null,"Business","Unit 11 - Building Successful Business Teams",30,"Internal"]
[null,null,null,null,null,null,null,null,null,null,null,null,null,null,null,"Performing Arts Acting","Unit 8 - The Performing Arts Industry ",30,"External",null,"Business","Unit 12 - Introducing Law and Consumer Rights",30,"Internal"]
[null,null,null,null,null,null,null,null,null,null,null,null,null,null,null,"Performing Arts Dance","Unit 8 - The Performing Arts Industry ",30,"External",null,"Business","Unit 13 - Financial Planning and Forecasting",30,"Internal"]
[null,null,null,null,null,null,null,null,null,null,null,null,null,null,null,"Performing Arts Musical Theatre","Unit 8 - The Performing Arts Industry ",30,"External",null,"Business","Unit 14 - Business Online",60,"Internal"]
[null,null,null,null,null,null,null,null,null,null,null,null,null,null,null,"Performing Arts Production","Unit 8 - The Performing Arts Industry ",30,"External",null,"Business","Unit 15 - Public Sector Business",30,"Internal"]
[null,null,null,null,null,null,null,null,null,null,null,null,null,null,null,"Public Services","Unit 7 - Crime and its Effects on Society and Individuals",60,"Internal",null,"Business","Unit 16 - Enhancing the Customer Experience",30,"Internal"]
[null,null,null,null,null,null,null,null,null,null,null,null,null,null,null,"Travel and Tourism","Unit 7 - Travel and Tourism Business Environments",30,"External",null,"Business","Unit 17 - Visual Merchandising in Retail Business",30,"Internal"]
[null,null,null,null,null,null,null,null,null,null,null,null,null,null,null,null,null,null,null,null,"CPLD","Unit 5 - Health and Safety in Early Years Settings",30,"Internal"]
[null,null,null,null,null,null,null,null,null,null,null,null,null,null,null,"Art and Design","Unit 7 - Recording for Creative Intentions in Art and Design",30,"External",null,"CPLD","Unit 6 - Supporting Children’s Language and Literacy Development",30,"Internal"]
[null,null,null,null,null,null,null,null,null,null,null,null,null,null,null,"Art and Design Design Crafts","Unit 7 - Recording for Creative Intentions in Art and Design",30,"External",null,"CPLD","Unit 7 - Making Healthy Food Choices for Children",30,"Internal"]
[null,null,null,null,null,null,null,null,null,null,null,null,null,null,null,"Art and Design Fashion and Textiles","Unit 7 - Recording for Creative Intentions in Art and Design",30,"External",null,"CPLD","Unit 8 - Introduction to Working in the Early Years Sector",30,"Internal"]
[null,null,null,null,null,null,null,null,null,null,null,null,null,null,null,"Art and Design Photography","Unit 7 - Recording for Creative Intentions in Art and Design",30,"External",null,"Construction and the Built Environment","Unit 4 - Construction Processes and Operations",30,"Internal"]
[null,null,null,null,null,null,null,null,null,null,null,null,null,null,null,"Art and Design Product Design","Unit 7 - Recording for Creative Intentions in Art and Design",30,"External",null,"Construction and the Built Environment","Unit 5 - Construction Drawing Techniques",30,"Internal"]
[null,null,null,null,null,null,null,null,null,null,null,null,null,null,null,"Art and Design Visual Arts","Unit 7 - Recording for Creative Intentions in Art and Design",30,"External",null,"Construction and the Built Environment","Unit 6 - Exploring Carpentry and Joinery Principles and Techniques",30,"Internal"]
[null,null,null,null,null,null,null,null,null,null,null,null,null,null,null,"Art and Design Visual Communication","Unit 7 - Recording for Creative Intentions in Art and Design",30,"External",null,"Construction and the Built Environment","Unit 7 - Exploring Brickwork and Blockwork Principles and Techniques",30,"Internal"]
[null,null,null,null,null,null,null,null,null,null,null,null,null,null,null,null,null,null,null,null,"Construction and the Built Environment","Unit 8 - Exploring Painting and Decorating Principles and Techniques",30,"Internal"]
[null,null,null,null,null,null,null,null,null,null,null,null,null,null,null,null,null,null,null,null,"Construction and the Built Environment","Unit 9 - Exploring Plumbing Principles and Techniques",30,"Internal"]
[null,null,null,null,null,null,null,null,null,null,null,null,null,null,null,null,null,null,null,null,"Construction and the Built Environment","Unit 10 - Exploring Electrical Principles and Techniques",30,"Internal"]
[null,null,null,null,null,null,null,null,null,null,null,null,null,null,null,null,null,null,null," ","Construction and the Built Environment","Unit 12 - The Construction Industry",30,"Internal"]
[null,null,null,null,null,null,null,null,null,null,null,null,null,null,null,null,null,null,null,null,"Construction and the Built Environment","Unit 13 - Exploring Roofing Principles and Techniques",30,"Internal"]
[null,null,null,null,null,null,null,null,null,null,null,null,null,null,null,null,null,null,null,null,"Construction and the Built Environment","Unit 14 - Exploring Wall and Floor Tiling Principles and Techniques",30,"Internal"]
[null,null,null,null,null,null,null,null,null,null,null,null,null,null,null,null,null,null,null,null,"Construction and the Built Environment","Unit 15 - Exploring Plastering and Dry Lining Principles and Techniques",30,"Internal"]
[null,null,null,null,null,null,null,null,null,null,null,null,null,null,null,null,null,null,null,null,"Construction and the Built Environment","Unit 16 - Carpentry and Joinery Operations",60,"Internal"]
[null,null,null,null,null,null,null,null,null,null,null,null,null,null,null,null,null,null,null,null,"Construction and the Built Environment","Unit 17 - Brickwork and Blockwork Operations",60,"Internal"]
[null,null,null,null,null,null,null,null,null,null,null,null,null,null,null,"Hospitality","Unit 14 - Teamwork in Hospitality",60,"Internal",null,"Construction and the Built Environment","Unit 18 - Painting and Paperhanging Operations",60,"Internal"]
[null,null,null,null,null,null,null,null,null,null,null,null,null,null,null,"Information and Creative Technology",null," "," ",null,"Construction and the Built Environment","Unit 19 - Plumbing Operations",30,"Internal"]
[null,null,null,null,null,null,null,null,null,null,null,null,null,null,null,"Music","Unit 17 - Researching a Music Topic",60,"Internal",null,"Construction and the Built Environment","Unit 20 - Electrical Operations",30,"Internal"]
[null,null,null,null,null,null,null,null,null,null,null,null,null,null,null,"Performing Arts Acting",null," "," ",null,"Creative Digital Media Production","Unit 3 - Digital Moving Image Production",30,"Internal"]
[null,null,null,null,null,null,null,null,null,null,null,null,null,null,null,null,null,null,null,null,"Creative Digital Media Production","Unit 4 - Digital Audio Production",30,"Internal"]
[null,null,null,null,null,null,null,null,null,null,null,null,null,null,null,null,null,null,null,null,"Creative Digital Media Production","Unit 5 - Digital Publishing Production",30,"Internal"]
[null,null,null,null,null,null,null,null,null,null,null,null,null,null,null,null,null,null,null,null,"Creative Digital Media Production","Unit 6 - Website Production",30,"Internal"]
[null,null,null,null,null,null,null,null,null,null,null,null,null,null,null,null,null,null,null,null,"Creative Digital Media Production","Unit 7 - Digital Games Production",30,"Internal"]
[null,null,null,null,null,null,null,null,null,null,null,null,null,null,null,null,null,null,null,null,"Creative Digital Media Production","Unit 9 - Digital Editing for Moving Image",60,"Internal"]
[null,null,null,null,null,null,null,null,null,null,null,null,null,null,null,null,null,null,null,null,"Creative Digital Media Production","Unit 10 - Digital Photography for a Media Product",60,"Internal"]
[null,null,null,null,null,null,null,null,null,null,null,null,null,null,null,"Performing Arts Dance",null," "," ",null,"Creative Digital Media Production","Unit 11 - Animation for Digital Media",60,"Internal"]
[null,null,null,null,null,null,null,null,null,null,null,null,null,null,null,"Performing Arts Musical Theatre",null," "," ",null,"Creative Digital Media Production","Unit 12 - Digital Audio Editing",30,"Internal"]
[null,null,null,null,null,null,null,null,null,null,null,null,null,null,null,"Performing Arts Production",null," "," ",null,"Creative Digital Media Production","Unit 13 - Graphic Design for Digital Media",30,"Internal"]
[null,null,null,null,null,null,null,null,null,null,null,null,null,null,null,"Sport",null," "," ",null,"Creative Digital Media Production","Unit 14 - Writing for Digital Media",30,"Internal"]
[null,null,null,null,null,null,null,null,null,null,null,null,null,null,null,"Travel and Tourism",null," "," ",null,"Creative Digital Media Production","Unit 15 - Digital Games Testing",30,"Internal"]
[null,null,null,null,null,null,null,null,null,null,null,null,null,null,null,"Applied Science","Unit 3 - Energy and out Universe",30,"Internal",null,"Creative Digital Media Production","Unit 16 - Digital Art for a Media Product ",30,"Internal"]
[null,null,null,null,null,null,null,null,null,null,null,null,null,null,null,null,null,null,null,null,"Creative Digital Media Production","Unit 17 - Digital Audio Mixing ",30,"Internal"]
[null,null,null,null,null,null,null,null,null,null,null,null,null,null,null,null,null,null,null,null,"Creative Digital Media Production","Unit 18 - Lighting for Moving Image  ",30,"Internal"]
[null,null,null,null,null,null,null,null,null,null,null,null,null,null,null,null,null,null,null,null,"Engineering","Unit 3 - Health and Safety in Engineering",30,"Internal"]
[null,null,null,null,null,null,null,null,null,null,null,null,null,null,null,null,null,null,null,null,"Engineering","Unit 4 - Engineering Maintenance",30,"Internal"]
[null,null,null,null,null,null,null,null,null,null,null,null,null,null,null,null,null,null,null,null,"Engineering","Unit 5 - Engineering Materials",30,"Internal"]
[null,null,null,null,null,null,null,null,null,null,null,null,null,null,null,null,null,null,null,null,"Engineering","Unit 6 - Computer-aided Engineering",30,"Internal"]
[null,null,null,null,null,null,null,null,null,null,null,null,null,null,null,"Art and Design","Unit 16 - Applying Contextual References in Art and Design",30,"Internal",null,"Engineering","Unit 7 - Machining Techniques",60,"Internal"]
[null,null,null,null,null,null,null,null,null,null,null,null,null,null,null,"Art and Design Design Crafts","Unit 9 - Design Crafts Briefs",60,"Internal",null,"Engineering","Unit 8 - Electronic Circuit Design and Construction",60,"Internal"]
[null,null,null,null,null,null,null,null,null,null,null,null,null,null,null,"Art and Design Fashion and Textiles","Unit 10 - Fashion Briefs",60,"Internal",null,"Engineering","Unit 11 - Electrical and Mechanical Science for Engineering",30,"Internal"]
[null,null,null,null,null,null,null,null,null,null,null,null,null,null,null,"Art and Design Photography","Unit 14 - Photography Briefs",60,"Internal",null,"Engineering","Unit 12 - Engineering Design",60,"Internal"]
[null,null,null,null,null,null,null,null,null,null,null,null,null,null,null,"Art and Design Product Design","Unit 15 - Designing for the Future",60,"Internal",null,"Engineering","Unit 13 - Engineering Assembly",30,"Internal"]
[null,null,null,null,null,null,null,null,null,null,null,null,null,null,null,"Art and Design Visual Arts","Unit 13 - Visual Arts Briefs",60,"Internal",null,"Engineering","Unit 14 - Vehicle Engines and Other Systems",30,"Internal"]
[null,null,null,null,null,null,null,null,null,null,null,null,null,null,null,"Art and Design Visual Communication","Unit 11 - Graphic Design Briefs",60,"Internal",null,"Engineering","Unit 15 - Operating an Efficient Workplace",60,"Internal"]
[null,null,null,null,null,null,null,null,null,null,null,null,null,null,null,null,null,null,null,null,"Engineering","Unit 16 - Vehicle Electrical Systems",30,"Internal"]
[null,null,null,null,null,null,null,null,null,null,null,null,null,null,null,null,null,null,null,null,"Engineering","Unit 17 - Welding",60,"Internal"]
[null,null,null,null,null,null,null,null,null,null,null,null,null,null,null,null,null,null,null,null,"Engineering","Unit 18 - Computer Numerical Control Programming",60,"Internal"]
[null,null,null,null,null,null,null,null,null,null,null,null,null,null,null,null,null,null,null,null,"Engineering","Unit 19 - Bicycle Servicing and Maintenance",30,"Internal"]
[null,null,null,null,null,null,null,null,null,null,null,null,null,null,null,null,null,null,null,null,"Engineering","Unit 20 - Sustainable Vehicle Power and Structure Design",60,"Internal"]
[null,null,null,null,null,null,null,null,null,null,null,null,null,null,null,null,null,null,null,null,"Health and Social Care","Unit 4 - Social Influences on Health and Wellbeing",30,"Internal"]
[null,null,null,null,null,null,null,null,null,null,null,null,null,null,null,null,null,null,null,null,"Health and Social Care","Unit 5 - Promoting Health and Wellbeing",30,"Internal"]
[null,null,null,null,null,null,null,null,null,null,null,null,null,null,null,null,null,null,null,null,"Health and Social Care","Unit 6 - The Impact of Nutrition on Health and Wellbeing",30,"Internal"]
[null,null,null,null,null,null,null,null,null,null,null,null,null,null,null,null,null,null,null,null,"Health and Social Care","Unit 7 - Equality and Diversity in Health and Social Care",30,"Internal"]
[null,null,null,null,null,null,null,null,null,null,null,null,null,null,null,null,null,null,null,null,"Health and Social Care","Unit 8 - Individual Rights in Health and Social Care",30,"Internal"]
[null,null,null,null,null,null,null,null,null,null,null,null,null,null,null,null,null,null,null,null,"Health and Social Care","Unit 10 - Human Body Systems and Care of Disorders",60,"Internal"]
[null,null,null,null,null,null,null,null,null,null,null,null,null,null,null,null,null,null,null,null,"Health and Social Care","Unit 11 - Services in Health and Social Care",30,"Internal"]
[null,null,null,null,null,null,null,null,null,null,null,null,null,null,null,null,null,null,null,null,"Health and Social Care","Unit 12 - Creative and Therapeutic Activities in Health and Social Care",60,"Internal"]
[null,null,null,null,null,null,null,null,null,null,null,null,null,null,null,null,null,null,null,null,"Health and Social Care","Unit 13 - The Health and Social Care Sector",30,"Internal"]
[null,null,null,null,null,null,null,null,null,null,null,null,null,null,null,null,null,null,null,null,"Health and Social Care","Unit 14 - The Early Years Sector",30,"Internal"]
[null,null,null,null,null,null,null,null,null,null,null,null,null,null,null,"Applied Science","Unit 4 - Biology and our Environment",30,"Internal",null,"Hospitality","Unit 4 - Costing and Controlling Finances in the Hospitality Industry",30,"Internal"]
[null,null,null,null,null,null,null,null,null,null,null,null,null,null,null,null,null,null,null,null,"Hospitality","Unit 5 - Enterprise in the Hospitality Industry",30,"Internal"]
[null,null,null,null,null,null,null,null,null,null,null,null,null,null,null,"Applied Science","Unit 5 - Applications of Chemical Substances",30,"Internal",null,"Hospitality","Unit 6 - Planning, Preparing, Cooking and Finishing Food",30,"Internal"]
[null,null,null,null,null,null,null,null,null,null,null,null,null,null,null,"Art and Design Design Crafts","Unit 16 - Applying Contextual References in Art and Design",30,"Internal"]
[null,null,null,null,null,null,null,null,null,null,null,null,null,null,null,"Art and Design Fashion and Textiles","Unit 12 - Textile Briefs",60,"Internal"]
[null,null,null,null,null,null,null,null,null,null,null,null,null,null,null,"Art and Design Photography","Unit 16 - Applying Contextual References in Art and Design",30,"Internal"]
[null,null,null,null,null,null,null,null,null,null,null,null,null,null,null,"Art and Design Product Design","Unit 16 - Applying Contextual References in Art and Design",30,"Internal"]
[null,null,null,null,null,null,null,null,null,null,null,null,null,null,null,"Art and Design Visual Arts","Unit 16 - Applying Contextual References in Art and Design",30,"Internal"]
[null,null,null,null,null,null,null,null,null,null,null,null,null,null,null,"Art and Design Visual Communication","Unit 16 - Applying Contextual References in Art and Design",30,"Internal",null,"Hospitality","Unit 7 - Food and Beverage Service in the Hospitality Industry",30,"Internal"]
[]
[null,null,null,null,null,null,null,null,null,null,null,null,null,null,null,"Applied Science","Unit 6 - Applications of Physical Science",30,"Internal",null,"Hospitality","Unit 8 - Front Office Services in the Hospitality Industry",30,"Internal"]
[null,null,null,null,null,null,null,null,null,null,null,null,null,null,null,"Art and Design Fashion and Textiles","Unit 16 - Applying Contextual References in Art and Design",30,"Internal"]
[null,null,null,null,null,null,null,null,null,null,null,null,null,null,null,null,null,null,null,null,"Hospitality","Unit 10 - Marketing and Promotion in Hospitality",30,"Internal"]
[null,null,null,null,null,null,null,null,null,null,null,null,null,null,null,"Applied Science","Unit 7 - Health Applications of Life Science",30,"Internal",null,"Hospitality","Unit 11 - Accommodation Services in the Hospitality Industry",30,"Internal"]
[null,null,null,null,null,null,null,null,null,null,null,null,null,null,null,null,null,null,null,null,"Hospitality","Unit 12 - Planning and Running a Hospitality Event",60,"Internal"]
[null,null,null,null,null,null,null,null,null,null,null,null,null,null,null,"Applied Science","Unit 8 - Scientific Skills",30,"Internal",null,"Hospitality","Unit 13 - Contemporary World Food Cooking Skills",60,"Internal"]
[null,null,null,null,null,null,null,null,null,null,null,null,null,null,null,null,null,null,null,null,"Hospitality","Unit 15 - Menu Planning",60,"Internal"]
[null,null,null,null,null,null,null,null,null,null,null,null,null,null,null,null,null,null,null,null,"Hospitality","Unit 16 - Managing Finance in Hospitality",60,"Internal"]
[null,null,null,null,null,null,null,null,null,null,null,null,null,null,null,null,null,null,null,null,"Hospitality","Unit 17 - Alcohol Awareness in Hospitality",30,"Internal"]
[null,null,null,null,null,null,null,null,null,null,null,null,null,null,null,null," ",null,null,null,"Information and Creative Technology","Unit 4 - Creating Digital Animation",30,"Internal"]
[null,null,null,null,null,null,null,null,null,null,null,null,null,null,null,null,null,null,null,null,"Information and Creative Technology","Unit 5 - Creating Digital Audio",30,"Internal"]
[null,null,null,null,null,null,null,null,null,null,null,null,null,null,null,null,null,null,null,null,"Information and Creative Technology","Unit 6 - Creating Digital Graphics",30,"Internal"]
[null,null,null,null,null,null,null,null,null,null,null,null,null,null,null,null,null,null,null,null,"Information and Creative Technology","Unit 7 - Creating Digital Video",30,"Internal"]
[null,null,null,null,null,null,null,null,null,null,null,null,null,null,null,null,null,null,null,null,"Information and Creative Technology","Unit 8 - Mobile Apps Development",30,"Internal"]
[null,null,null,null,null,null,null,null,null,null,null,null,null,null,null,null,null,null,null,null,"Information and Creative Technology","Unit 9 - Spreadsheet Development",30,"Internal"]
[null,null,null,null,null,null,null,null,null,null,null,null,null,null,null,null,null,null,null,null,"Information and Creative Technology","Unit 10 - Database Development",60,"Internal"]
[null,null,null,null,null,null,null,null,null,null,null,null,null,null,null,null,null,null,null,null,"Information and Creative Technology","Unit 11 - Computer Networks",60,"Internal"]
[null,null,null,null,null,null,null,null,null,null,null,null,null,null,null,null,null,null,null,null,"Information and Creative Technology","Unit 12 - Software Development",60,"Internal"]
[null,null,null,null,null,null,null,null,null,null,null,null,null,null,null,null,null,null,null,null,"Information and Creative Technology","Unit 13 - Website Development",60,"Internal"]
[null,null,null,null,null,null,null,null,null,null,null,null,null,null,null,null,null,null,null,null,"Information and Creative Technology","Unit 14 - Installing and Maintaining Computer Hardware",60,"Internal"]
[null,null,null,null,null,null,null,null,null,null,null,null,null,null,null,null,null,null,null,null,"Information and Creative Technology","Unit 15 - Installing and Maintaining Computer Software",60,"Internal"]
[null,null,null,null,null,null,null,null,null,null,null,null,null,null,null,null,null,null,null,null,"Information and Creative Technology","Unit 16 - Automated Computer Systems",60,"Internal"]
[null,null,null,null,null,null,null,null,null,null,null,null,null,null,null,null,null,null,null,null,"Information and Creative Technology","Unit 17 - Multimedia Products Development",60,"Internal"]
[null,null,null,null,null,null,null,null,null,null,null,null,null,null,null,null,null,null,null,null,"Music","Unit 3 - Introducing Live Sound",30,"Internal"]
[null,null,null,null,null,null,null,null,null,null,null,null,null,null,null,null,null,null,null,null,"Music","Unit 4 - Introducing Music Composition",30,"Internal"]
[null,null,null,null,null,null,null,null,null,null,null,null,null,null,null,null,null,null,null,null,"Music","Unit 5 - Introducing Music Performance",30,"Internal"]
[null,null,null,null,null,null,null,null,null,null,null,null,null,null,null,null,null,null,null,null,"Music","Unit 6 - Introducing Music Recording",30,"Internal"]
[null,null,null,null,null,null,null,null,null,null,null,null,null,null,null,null,null,null,null,null,"Music","Unit 7 - Introducing Music Sequencing",30,"Internal"]
[null,null,null,null,null,null,null,null,null,null,null,null,null,null,null,null,null,null,null,null,"Music","Unit 9 - Introducing Choral Studies",30,"Internal"]
[null,null,null,null,null,null,null,null,null,null,null,null,null,null,null,null,null,null,null,null,"Music","Unit 10 - Introducing Music Theory",30,"Internal"]
[null,null,null,null,null,null,null,null,null,null,null,null,null,null,null,null,null,null,null,null,"Music","Unit 11 - Developing Solo Music Performance",60,"Internal"]
[null,null,null,null,null,null,null,null,null,null,null,null,null,null,null,null,null,null,null,null,"Music","Unit 12 - The Development of Music",60,"Internal"]
[null,null,null,null,null,null,null,null,null,null,null,null,null,null,null,null,null,null,null,null,"Music","Unit 13 - Developing Music Composition",60,"Internal"]
[null,null,null,null,null,null,null,null,null,null,null,null,null,null,null,null,null,null,null,null,"Music","Unit 14 - Producing a Music Recording",60,"Internal"]
[null,null,null,null,null,null,null,null,null,null,null,null,null,null,null,null,null,null,null,null,"Music","Unit 15 - Music Ensemble",60,"Internal"]
[null,null,null,null,null,null,null,null,null,null,null,null,null,null,null,null,null,null,null,null,"Music","Unit 18 - Developing Modern Music Production Skills",60,"Internal"]
[null,null,null,null,null,null,null,null,null,null,null,null,null,null,null,null,null,null,null,null,"Music","Unit 19 - Developing Music Theory",60,"Internal"]
[null,null,null,null,null,null,null,null,null,null,null,null,null,null,null,null,null,null,null,null,"Music","Unit 20 - Music Fusion",60,"Internal"]
[null,null,null,null,null,null,null,null,null,null,null,null,null,null,null,null,null,null,null,null,"Music","Unit 21 - Music Arrangement",60,"Internal"]
[null,null,null,null,null,null,null,null,null,null,null,null,null,null,null,null,null,null,null,null,"Music","Unit 22 - Exploring Music Improvisation",60,"Internal"]
[null,null,null,null,null,null,null,null,null,null,null,null,null,null,null,null,null,null,null,null,"Music","Unit 23 - Exploring Djing",60,"Internal"]
[null,null,null,null,null,null,null,null,null,null,null,null,null,null,null,null,null,null,null,null,"Performing Arts","Unit 3 - Acting Skills",60,"Internal"]
[null,null,null,null,null,null,null,null,null,null,null,null,null,null,null,null,null,null,null,null,"Performing Arts","Unit 4 - Dance Skills",60,"Internal"]
[null,null,null,null,null,null,null,null,null,null,null,null,null,null,null,null,null,null,null,null,"Performing Arts","Unit 5 - Musical Theatre Skills",60,"Internal"]
[null,null,null,null,null,null,null,null,null,null,null,null,null,null,null,null,null,null,null,null,"Performing Arts","Unit 6 - Music Performance Skills",60,"Internal"]
[null,null,null,null,null,null,null,null,null,null,null,null,null,null,null,null,null,null,null,null,"Performing Arts","Unit 7 - Production Skills for Performance",60,"Internal"]
[null,null,null,null,null,null,null,null,null,null,null,null,null,null,null,null,null,null,null,null,"Performing Arts","Unit 9 - Performance in Context",30,"Internal"]
[null,null,null,null,null,null,null,null,null,null,null,null,null,null,null,null,null,null,null,null,"Performing Arts","Unit 10 - Movement Skills",30,"Internal"]
[null,null,null,null,null,null,null,null,null,null,null,null,null,null,null,null,null,null,null,null,"Performing Arts","Unit 11 - Devising Performance Work",30,"Internal"]
[null,null,null,null,null,null,null,null,null,null,null,null,null,null,null,null,null,null,null,null,"Performing Arts","Unit 12 - Exploring Improvisation",30,"Internal"]
[null,null,null,null,null,null,null,null,null,null,null,null,null,null,null,null,null,null,null,null,"Performing Arts","Unit 13 - Multimedia Performance",30,"Internal"]
[null,null,null,null,null,null,null,null,null,null,null,null,null,null,null,null,null,null,null,null,"Performing Arts","Unit 14 - Voice and Speech for Performers",30,"Internal"]
[null,null,null,null,null,null,null,null,null,null,null,null,null,null,null,null,null,null,null,null,"Performing Arts","Unit 15 - Performing Scripted Plays",30,"Internal"]
[null,null,null,null,null,null,null,null,null,null,null,null,null,null,null,null,null,null,null,null,"Performing Arts","Unit 16 - Contemporary Dance Techniques",30,"Internal"]
[null,null,null,null,null,null,null,null,null,null,null,null,null,null,null,null,null,null,null,null,"Performing Arts","Unit 17 - Exploring Urban Dance Styles",30,"Internal"]
[null,null,null,null,null,null,null,null,null,null,null,null,null,null,null,null,null,null,null,null,"Performing Arts","Unit 18 - Jazz Dance Techniques",30,"Internal"]
[null,null,null,null,null,null,null,null,null,null,null,null,null,null,null,null,null,null,null,null,"Performing Arts","Unit 19 - Design Planning for Performance",30,"Internal"]
[null,null,null,null,null,null,null,null,null,null,null,null,null,null,null,null,null,null,null,null,"Performing Arts","Unit 20 - Realising Costume Design for Performance",30,"Internal"]
[null,null,null,null,null,null,null,null,null,null,null,null,null,null,null,null,null,null,null,null,"Performing Arts","Unit 21 - Realising Set Design for Performance",30,"Internal"]
[null,null,null,null,null,null,null,null,null,null,null,null,null,null,null,null,null,null,null,null,"Performing Arts","Unit 22 - Realising Prop Design for Performance",30,"Internal"]
[null,null,null,null,null,null,null,null,null,null,null,null,null,null,null,null,null,null,null,null,"Performing Arts","Unit 23 - Realising Mask Design for Performance",30,"Internal"]
[null,null,null,null,null,null,null,null,null,null,null,null,null,null,null,null,null,null,null,null,"Performing Arts","Unit 24 - Lighting for Performance",30,"Internal"]
[null,null,null,null,null,null,null,null,null,null,null,null,null,null,null,null,null,null,null,null,"Performing Arts","Unit 25 - Sound for Performance",30,"Internal"]
[null,null,null,null,null,null,null,null,null,null,null,null,null,null,null,null,null,null,null,null,"Performing Arts","Unit 26 - Supporting Performance: Stage Management",30,"Internal"]
[null,null,null,null,null,null,null,null,null,null,null,null,null,null,null,null,null,null,null,null,"Performing Arts","Unit 27 - Supporting Performance: Front of House",30,"Internal"]
[null,null,null,null,null,null,null,null,null,null,null,null,null,null,null,null,null,null,null,null,"Performing Arts","Unit 28 - Make-up for Performance",30,"Internal"]
[null,null,null,null,null,null,null,null,null,null,null,null,null,null,null,null,null,null,null,null,"Performing Arts","Unit 29 - Wardrobe for Stage Performance",30,"Internal"]
[null,null,null,null,null,null,null,null,null,null,null,null,null,null,null,null,null,null,null,null,"Sport","Unit 3 - The Mind and Sports Performance",30,"Internal"]
[null,null,null,null,null,null,null,null,null,null,null,null,null,null,null,null,null,null,null,null,"Sport","Unit 4 - The Sports Performer in Action",30,"Internal"]
[null,null,null,null,null,null,null,null,null,null,null,null,null,null,null,null,null,null,null,null,"Sport","Unit 5 - Training for Personal Fitness",30,"Internal"]
[null,null,null,null,null,null,null,null,null,null,null,null,null,null,null,null,null,null,null,null,"Sport","Unit 6 - Leading Sports Activities",30,"Internal"]
[null,null,null,null,null,null,null,null,null,null,null,null,null,null,null,null,null,null,null,null,"Sport","Unit 8 - Promotion and Sponsorship in Sport",30,"Internal"]
[null,null,null,null,null,null,null,null,null,null,null,null,null,null,null,null,null,null,null,null,"Sport","Unit 9 - Lifestyle and Well-being",30,"Internal"]
[null,null,null,null,null,null,null,null,null,null,null,null,null,null,null,null,null,null,null,null,"Sport","Unit 10 - Injury and the Sports Performer",30,"Internal"]
[null,null,null,null,null,null,null,null,null,null,null,null,null,null,null,null,null,null,null,null,"Sport","Unit 11 - Running a Sports Event",30,"Internal"]
[null,null,null,null,null,null,null,null,null,null,null,null,null,null,null,null,null,null,null,null,"Sport","Unit 12 - The Sport and Active Leisure Industry",30,"Internal"]
[null,null,null,null,null,null,null,null,null,null,null,null,null,null,null,null,null,null,null,null,"Sport","Unit 13 - Profiling Sports Performance",30,"Internal"]
[null,null,null,null,null,null,null,null,null,null,null,null,null,null,null,null,null,null,null,null,"Travel and Tourism","Unit 3 - The Development of Travel and Tourism in the UK",30,"Internal"]
[null,null,null,null,null,null,null,null,null,null,null,null,null,null,null,null,null,null,null,null,"Travel and Tourism","Unit 5 - Factors Affecting Worldwide Travel and Tourism",30,"Internal"]
[null,null,null,null,null,null,null,null,null,null,null,null,null,null,null,null,null,null,null,null,"Travel and Tourism","Unit 6 -The Travel and Tourism Customer Experience",30,"Internal"]
[null,null,null,null,null,null,null,null,null,null,null,null,null,null,null,null,null,null,null,null,"Travel and Tourism","Unit 8 - Promotion and Sales in Travel and Tourism",30,"Internal"]
[null,null,null,null,null,null,null,null,null,null,null,null,null,null,null,null,null,null,null,null,"Travel and Tourism","Unit 9 - Travel and Tourism Employment Opportunities",30,"Internal"]
[null,null,null,null,null,null,null,null,null,null,null,null,null,null,null,null,null,null,null,null,"Travel and Tourism","Unit 10 - Organising a Travel and Tourism Study Visit",30,"Internal"]
[null,null,null,null,null,null,null,null,null,null,null,null,null,null,null,null,null,null,null,null,"Travel and Tourism","Unit 16 - Holiday Representatives",30,"Internal"]
[null,null,null,null,null,null,null,null,null,null,null,null,null,null,null,null,null,null,null,null,"Travel and Tourism","Unit 17 - UK Travel Agency Operations",30,"Internal"]
[null,null,null,null,null,null,null,null,null,null,null,null,null,null,null,null,null,null,null,null,"Travel and Tourism","Unit 18 - The Cruise Industry",30,"Internal"]
[null,null,null,null,null,null,null,null,null,null,null,null,null,null,null,null,null,null,null,null,"Travel and Tourism","Unit 19 - Hospitality Operations in the Travel and Tourism \nSector",30,"Internal"]
[null,null,null,null,null,null,null,null,null,null,null,null,null,null,null,null,null,null,null,null,"Travel and Tourism","Unit 20 - UK Visitor Attractions",30,"Internal"]
[null,null,null,null,null,null,null,null,null,null,null,null,null,null,null,null,null,null,null,null,"Applied Science","Unit 9 - Practical Scientific Project ",30,"Internal"]
[null,null,null,null,null,null,null,null,null,null,null,null,null,null,null,null,null,null,null,null,"Applied Science","Unit 10 - World Energy",30,"Internal"]
[null,null,null,null,null,null,null,null,null,null,null,null,null,null,null,null,null,null,null,null,"Applied Science","Unit 11 - How Scientific Theories are Formulated ",30,"Internal"]
[null,null,null,null,null,null,null,null,null,null,null,null,null,null,null,null,null,null,null,null,"Applied Science","Unit 12 - The Living Body",30,"Internal"]
[null,null,null,null,null,null,null,null,null,null,null,null,null,null,null,null,null,null,null,null,"Applied Science","Unit 13 - Monitoring the Environment ",30,"Internal"]
[null,null,null,null,null,null,null,null,null,null,null,null,null,null,null,null,null,null,null,null,"Applied Science","Unit 14 - Growing Plants for Food ",30,"Internal"]
[null,null,null,null,null,null,null,null,null,null,null,null,null,null,null,null,null,null,null,null,"Applied Science","Unit 15 - Investigating a Crime Scene ",30,"Internal"]
[null,null,null,null,null,null,null,null,null,null,null,null,null,null,null,null,null,null,null,null,"Applied Science","Unit 16 - Science in Medicine ",30,"Internal"]
[null,null,null,null,null,null,null,null,null,null,null,null,null,null,null,null,null,null,null,null,"Applied Science","Unit 17 - Understanding Human Behaviour ",30,"Internal"]
[null,null,null,null,null,null,null,null,null,null,null,null,null,null,null,null,null,null,null,null,"Applied Science","Unit 18 - Designing and Making Useful Devices in Science",30,"Internal"]
[null,null,null,null,null,null,null,null,null,null,null,null,null,null,null,null,null,null,null,null,"Applied Science","Unit 19 - Chemical Analysis and Detection ",30,"Internal"]
[null,null,null,null,null,null,null,null,null,null,null,null,null,null,null,null,null,null,null,null,"Applied Science","Unit 20 - Exploring our Universe ",30,"Internal"]
[null,null,null,null,null,null,null,null,null,null,null,null,null,null,null,null,null,null,null,null,"Applied Science","Unit 21 - Electronics in Action",30,"Internal"]
[null,null,null,null,null,null,null,null,null,null,null,null,null,null,null,null,null,null,null,null,"Applied Science","Unit 22 - Biotechnology Procedures and Applications",30,"Internal"]
[null,null,null,null,null,null,null,null,null,null,null,null,null,null,null,null,null,null,null,null,"Applied Science","Unit 23 - Further Chemistry ",30,"Internal"]
[null,null,null,null,null,null,null,null,null,null,null,null,null,null,null,null,null,null,null,null,"Applied Science","Unit 24 - Further Physics",30,"Internal"]
[null,null,null,null,null,null,null,null,null,null,null,null,null,null,null,null,null,null,null,null,"Public Services","Unit 3 - Employment in the Public Services",30,"Internal"]
[null,null,null,null,null,null,null,null,null,null,null,null,null,null,null,null,null,null,null,null,"Public Services","Unit 4 - Public Services and Community Protection",30,"Internal"]
[null,null,null,null,null,null,null,null,null,null,null,null,null,null,null,null,null,null,null,null,"Public Services","Unit 5 - Health, Fitness and Lifestyle for the Public Services",30,"Internal"]
[null,null,null,null,null,null,null,null,null,null,null,null,null,null,null,null,null,null,null,null,"Public Services","Unit 8 - Promotion of Public Service Provision",30,"Internal"]
[null,null,null,null,null,null,null,null,null,null,null,null,null,null,null,null,null,null,null,null,"Public Services","Unit 9 - Community and Cultural Awareness",30,"Internal"]
[null,null,null,null,null,null,null,null,null,null,null,null,null,null,null,null,null,null,null,null,"Public Services","Unit 10 - Adventurous Activities in the Public Services",30,"Internal"]
[null,null,null,null,null,null,null,null,null,null,null,null,null,null,null,null,null,null,null,null,"Public Services","Unit 11 - Sport and Recreation in the Public Services",30,"Internal"]
[null,null,null,null,null,null,null,null,null,null,null,null,null,null,null,null,null,null,null,null,"Public Services","Unit 12 - Land Navigation by Map and Compass",60,"Internal"]
[null,null,null,null,null,null,null,null,null,null,null,null,null,null,null,null,null,null,null,null,"Public Services","Unit 13 - Volunteering for the Public Services",60,"Internal"]
[null,null,null,null,null,null,null,null,null,null,null,null,null,null,null,null,null,null,null,null,"Public Services","Unit 14 - Multi-day Expedition Experience",60,"Internal"]
[null,null,null,null,null,null,null,null,null,null,null,null,null,null,null,null,null,null,null,null,"Public Services","Unit 15 - Health and Safety in the Public Services",60,"Internal"]
[null,null,null,null,null,null,null,null,null,null,null,null,null,null,null,null,null,null,null,null,"Public Services","Unit 16 - Employability Skills in the Public Services",60,"Internal"]
[null,null,null,null,null,null,null,null,null,null,null,null,null,null,null,null,null,null,null,null,"Public Services","Unit 17 - Preparing to Respond to Emergency Incidents",60,"Internal"]
[null,null,null,null,null,null,null,null,null,null,null,null,null,null,null,null,null,null,null,null,"Public Services","Unit 18 - Security Procedures in the Public Services",60,"Internal"]

{"sheet":"Diploma","index":10,"n_rows":50,"n_cols":14,"rows_kept":50,"cut":false,"hidden":false,"merged":[[6,7,6,8],[48,12,49,12]]}
["Art and Design"]
["Art and Design Design Crafts",null,null,null,null,null,"Diploma"]
["Art and Design Fashion and Textiles"]
["Art and Design Photography"]
["Art and Design Product Design",null,null,null,"Start ->","Select Sector"]
["Art and Design Visual Arts"]
["Art and Design Visual Communication",null,null,null,null,null,null,"480 GLH"]
["Business",null,null,null,null,"Type","Unit","GLH","Grade",null,"Points",null,"All","ICT"]
["Construction and the Built Environment",null,null,null,"Core",{"$f":"IF(ISERROR(VLOOKUP(G9,'Diploma Unit Data'!B3:D34,3,FALSE)),\"\",VLOOKUP(G9,'Diploma Unit Data'!B3:D34,3,FALSE))","v":""},{"$f":"IF(ISERROR(VLOOKUP(G5,'Diploma Unit Data'!A3:B34,2,FALSE)),\"\",VLOOKUP(G5,'Diploma Unit Data'!A3:B34,2,FALSE))","v":""},{"$f":"IF(ISERROR(VLOOKUP(G9,'Diploma Unit Data'!B3:D34,2,FALSE)),\"\",VLOOKUP(G9,'Diploma Unit Data'!B3:D34,2,FALSE))","v":""},null,{"$f":"IF(I9=\"U\",0,IF(I9=\"L1\",2,IF(I9=\"P\",4,IF(I9=\"M\",6,IF(I9=\"D\",8)))))","v":false},{"$f":"IF(ISERROR(IF(I9=\"\",\"\",J9*(H9/10))),\"\",IF(I9=\"\",\"\",J9*(H9/10)))","v":""},null,{"$f":"IF((K9+K10)<12,\"U\",IF(AND((K9+K10)>=12,(K9+K10)<24),\"Level 1\",M14))","v":{"$error":"#VALUE!"}},{"$f":"IF(N10+K11<12,\"U\",IF(AND((N10+K11)>=12,(N10+K11)<24),\"Level 1\",N14))","v":{"$error":"#VALUE!"}}]
["Creative Digital Media Production",null,null,null,null,{"$f":"IF(ISERROR(VLOOKUP(G10,'Diploma Unit Data'!G2:I34,3,FALSE)),\"\",VLOOKUP(G10,'Ext Cert Unit Data'!G2:I28,3,FALSE))","v":""},{"$f":"IF(ISERROR(VLOOKUP(G5,'Diploma Unit Data'!F3:G34,2,FALSE)),\"\",VLOOKUP(G5,'Diploma Unit Data'!F3:G34,2,FALSE))","v":""},{"$f":"IF(ISERROR(VLOOKUP(G10,'Diploma Unit Data'!G2:I34,2,FALSE)),\"\",VLOOKUP(G10,'Diploma Unit Data'!G2:I34,2,FALSE))","v":""},null,{"$f":"IF(I10=\"U\",0,IF(I10=\"L1\",2,IF(I10=\"P\",4,IF(I10=\"M\",6,IF(I10=\"D\",8)))))","v":false},{"$f":"IF(ISERROR(IF(I10=\"\",\"\",J10*(H10/10))),\"\",IF(I10=\"\",\"\",J10*(H10/10)))","v":""},null,null,{"$f":"IF(K9>K10,K9,K10)","v":""}]
["Engineering",null,null,null,null,{"$f":"IF(ISERROR(VLOOKUP(G11,'Diploma Unit Data'!L3:N34,3,FALSE)),\"\",VLOOKUP(G11,'Diploma Unit Data'!L3:N34,3,FALSE))","v":""},{"$f":"IF(ISERROR(VLOOKUP(G5,'Diploma Unit Data'!K3:N34,2,FALSE)),\"\",VLOOKUP(G5,'Diploma Unit Data'!K3:N34,2,FALSE))","v":""},{"$f":"IF(ISERROR(VLOOKUP(G11,'Diploma Unit Data'!L3:N34,2,FALSE)),\"\",VLOOKUP(G11,'Diploma Unit Data'!L3:N34,2,FALSE))","v":""},null,{"$f":"IF(I11=\"U\",0,IF(I11=\"L1\",2,IF(I11=\"P\",4,IF(I11=\"M\",6,IF(I11=\"D\",8)))))","v":false},{"$f":"IF(ISERROR(IF(I11=\"\",\"\",J11*(H11/10))),\"\",IF(I11=\"\",\"\",J11*(H11/10)))","v":""},null,{"$f":"IF(K11<12,\"U\",IF(AND(K11>=12,K11<24),\"Level 1\",M14))","v":0},{"$f":"IF(K12<12,\"U\",IF(AND(K12>=12,K12<24),\"Level 1\",N14))","v":0}]
["Engineering Technology Pathway",null,null,null,null,{"$f":"IF(ISERROR(VLOOKUP(G12,'Diploma Unit Data'!B40:D42,3,FALSE)),\"\",VLOOKUP(G12,'Diploma Unit Data'!B40:D42,3,FALSE))","v":""},{"$f":"IF(ISERROR(VLOOKUP(G5,'Diploma Unit Data'!A40:B42,2,FALSE)),\"\",VLOOKUP(G5,'Diploma Unit Data'!A40:B42,2,FALSE))","v":""},{"$f":"IF(ISERROR(VLOOKUP(G12,'Diploma Unit Data'!B40:D42,2,FALSE)),\"\",VLOOKUP(G12,'Diploma Unit Data'!B40:D42,2,FALSE))","v":""},null,{"$f":"IF(I12=\"U\",0,IF(I12=\"L1\",2,IF(I12=\"P\",4,IF(I12=\"M\",6,IF(I12=\"D\",8)))))","v":false},{"$f":"IF(ISERROR(IF(I12=\"\",\"\",J12*(H12/10))),\"\",IF(I12=\"\",\"\",J12*(H12/10)))","v":""}]
["Engineering Maintenance Pathway",null,null,null,null,null,null,null,null,null,null,null,{"$f":"IF(OR(M9=\"U\",M11=\"U\"),\"U\",IF(OR(M9=\"Level 1\",M11=\"Level 1\"),\"Level 1\",M14))","v":{"$error":"#VALUE!"}},{"$f":"IF(OR(N9=\"U\",N11=\"U\"),\"U\",IF(OR(N9=\"Level 1\",N11=\"Level 1\"),\"Level 1\",N14))","v":{"$error":"#VALUE!"}}]
["Engineering Manufacturing Pathway",null,null,null,{"$f":"IF(G5=\"Information and Creative Technology\",\"Core\",\"Mandatory\")","v":"Mandatory"},{"$f":"IF(ISERROR(VLOOKUP(G14,'Diploma Unit Data'!Q3:S35,3,FALSE)),\"\",VLOOKUP(G14,'Diploma Unit Data'!Q3:S35,3,FALSE))","v":""},{"$f":"IF(ISERROR(VLOOKUP(G5,'Diploma Unit Data'!P3:S35,2,FALSE)),\"\",VLOOKUP(G5,'Diploma Unit Data'!P3:Q35,2,FALSE))","v":""},{"$f":"IF(ISERROR(VLOOKUP(G14,'Diploma Unit Data'!Q3:R35,2,FALSE)),\"\",VLOOKUP(G14,'Diploma Unit Data'!Q3:R35,2,FALSE))","v":""},null,{"$f":"IF(I14=\"U\",0,IF(I14=\"L1\",2,IF(I14=\"P\",4,IF(I14=\"M\",6,IF(I14=\"D\",8)))))","v":false},{"$f":"IF(ISERROR(IF(I14=\"\",\"\",J14*(H14/10))),\"\",IF(I14=\"\",\"\",J14*(H14/10)))","v":""},null,{"$f":"SUM(K9:K12,K14:K21,K23:K31,K33:K40,K42:K46)","v":0},{"$f":"SUM(K9:K12,K14:K21,K23:K31,K33:K40,K42:K46)","v":0}]
["Engineering Mechanical Pathway",null,null,null,null,{"$f":"IF(ISERROR(VLOOKUP(G15,'Diploma Unit Data'!Q36:S135,3,FALSE)),\"\",VLOOKUP(G15,'Diploma Unit Data'!Q36:S135,3,FALSE))","v":""},{"$f":"IF(ISERROR(VLOOKUP(G5,'Diploma Unit Data'!P37:Q69,2,FALSE)),\"\",VLOOKUP(G5,'Diploma Unit Data'!P37:Q69,2,FALSE))","v":""},{"$f":"IF(ISERROR(VLOOKUP(G15,'Diploma Unit Data'!Q36:R135,2,FALSE)),\"\",VLOOKUP(G15,'Diploma Unit Data'!Q36:R135,2,FALSE))","v":""},null,false,"",null,{"$f":"IF(M13=\"U\",\"U\",IF(M13=\"Level 1\", \"Level 1\",M16))","v":{"$error":"#VALUE!"}},{"$f":"IF(N13=\"U\",\"U\",IF(N13=\"Level 1\", \"Level 1\",N16))","v":{"$error":"#VALUE!"}}]
["Health and Social Care",null,null,null,null,{"$f":"IF(ISERROR(VLOOKUP(G16,'Diploma Unit Data'!Q69:S108,3,FALSE)),\"\",VLOOKUP(G16,'Diploma Unit Data'!Q69:S108,3,FALSE))","v":""},{"$f":"IF(ISERROR(VLOOKUP(G5,'Diploma Unit Data'!P70:Q108,2,FALSE)),\"\",VLOOKUP(G5,'Diploma Unit Data'!P70:Q108,2,FALSE))","v":""},{"$f":"IF(ISERROR(VLOOKUP(G16,'Diploma Unit Data'!Q69:R108,2,FALSE)),\"\",VLOOKUP(G16,'Diploma Unit Data'!Q69:R108,2,FALSE))","v":""},null,false,"",null,{"$f":"VLOOKUP(M14,'Sheet1 (2)'!K2:L386,2,FALSE)","v":"U"},{"$f":"VLOOKUP(N14,'Sheet1 (2)'!K2:L386,2,FALSE)","v":"U"}]
["Hospitality",null,null,null,null,{"$f":"IF(ISERROR(VLOOKUP(G17,'Diploma Unit Data'!Q113:S139,3,FALSE)),\"\",VLOOKUP(G17,'Diploma Unit Data'!Q113:S139,3,FALSE))","v":""},{"$f":"IF(ISERROR(VLOOKUP(G5,'Diploma Unit Data'!P113:Q139,2,FALSE)),\"\",VLOOKUP(G5,'Diploma Unit Data'!P113:Q139,2,FALSE))","v":""},{"$f":"IF(ISERROR(VLOOKUP(G17,'Diploma Unit Data'!Q113:R139,2,FALSE)),\"\",VLOOKUP(G17,'Diploma Unit Data'!Q113:R139,2,FALSE))","v":""},null,false,""]
["Information and Creative Technology",null,null,null,null,{"$f":"IF(ISERROR(VLOOKUP(G18,'Diploma Unit Data'!Q141:S148,3,FALSE)),\"\",VLOOKUP(G18,'Diploma Unit Data'!Q141:S148,3,FALSE))","v":""},{"$f":"IF(ISERROR(VLOOKUP(G5,'Diploma Unit Data'!P141:Q148,2,FALSE)),\"\",VLOOKUP(G5,'Diploma Unit Data'!P141:Q148,2,FALSE))","v":""},{"$f":"IF(ISERROR(VLOOKUP(G18,'Diploma Unit Data'!Q141:R148,2,FALSE)),\"\",VLOOKUP(G18,'Diploma Unit Data'!Q141:R148,2,FALSE))","v":""},null,false,""]
["Information and Creative Technology Computer Science",null,null,null,null,{"$f":"IF(ISERROR(VLOOKUP(G19,'Diploma Unit Data'!Q150:S151,3,FALSE)),\"\",VLOOKUP(G19,'Diploma Unit Data'!Q150:S151,3,FALSE))","v":""},{"$f":"IF(ISERROR(VLOOKUP(G5,'Diploma Unit Data'!P150:Q151,2,FALSE)),\"\",VLOOKUP(G5,'Diploma Unit Data'!P150:Q151,2,FALSE))","v":""},{"$f":"IF(ISERROR(VLOOKUP(G19,'Diploma Unit Data'!Q150:R151,2,FALSE)),\"\",VLOOKUP(G19,'Diploma Unit Data'!Q150:R151,2,FALSE))","v":""},null,false,""]
["Information and Creative Technology Systems Development and Support",null,null,null,null,{"$f":"IF(ISERROR(VLOOKUP(G20,'Diploma Unit Data'!Q153:S153,3,FALSE)),\"\",VLOOKUP(G20,'Diploma Unit Data'!Q153:S153,3,FALSE))","v":""},{"$f":"IF(ISERROR(VLOOKUP(G5,'Diploma Unit Data'!P153:Q153,2,FALSE)),\"\",VLOOKUP(G5,'Diploma Unit Data'!P153:Q153,2,FALSE))","v":""},{"$f":"IF(ISERROR(VLOOKUP(G20,'Diploma Unit Data'!Q153:R153,2,FALSE)),\"\",VLOOKUP(G20,'Diploma Unit Data'!Q153:R153,2,FALSE))","v":""},null,false,""]
["Music",null,null,null,null,{"$f":"IF(ISERROR(VLOOKUP(G21,'Diploma Unit Data'!Q155:S155,3,FALSE)),\"\",VLOOKUP(G21,'Diploma Unit Data'!Q155:S155,3,FALSE))","v":""},{"$f":"IF(ISERROR(VLOOKUP(G5,'Diploma Unit Data'!P155:Q155,2,FALSE)),\"\",VLOOKUP(G5,'Ext Cert Unit Data'!P130:Q130,2,FALSE))","v":""},{"$f":"IF(ISERROR(VLOOKUP(G21,'Diploma Unit Data'!Q155:R155,2,FALSE)),\"\",VLOOKUP(G21,'Diploma Unit Data'!Q155:R155,2,FALSE))","v":""},null,false,""]
["Performing Arts"]
["Performing Arts Acting",null,null,null,{"$f":"IF(OR(G5=\"Art and Design\",G5=\"Art and Design Design Crafts\",G5=\"Art and Design Fashion and Textiles\",G5=\"Art and Design Photography\",G5=\"Art and Design Product Design\",G5=\"Art and Design Visual Arts\",G5=\"Art and Design Visual Communication\"),\"Optional\", \"Optional A\")","v":"Optional A"},{"$f":"IF(ISERROR(VLOOKUP(G23,'Diploma Unit Data'!$V$3:$X$356,3,FALSE)),\"\",VLOOKUP(G23,'Diploma Unit Data'!$V$3:$X$356,3,FALSE))","v":""},null,{"$f":"IF(ISERROR(VLOOKUP(G23,'Diploma Unit Data'!$V$3:$W$356,2,FALSE)),\"\",VLOOKUP(G23,'Diploma Unit Data'!$V$3:$W$356,2,FALSE))","v":""},null,{"$f":"IF(I23=\"U\",0,IF(I23=\"L1\",2,IF(I23=\"P\",4,IF(I23=\"M\",6,IF(I23=\"D\",8)))))","v":false},{"$f":"IF(ISERROR(IF(I23=\"\",\"\",J23*(H23/10))),\"\",IF(I23=\"\",\"\",J23*(H23/10)))","v":""}]
["Performing Arts Dance",null,null,null,null,{"$f":"IF(ISERROR(VLOOKUP(G24,'Diploma Unit Data'!$V$3:$X$356,3,FALSE)),\"\",VLOOKUP(G24,'Diploma Unit Data'!$V$3:$X$356,3,FALSE))","v":""},null,{"$f":"IF(ISERROR(VLOOKUP(G24,'Diploma Unit Data'!$V$3:$W$356,2,FALSE)),\"\",VLOOKUP(G24,'Diploma Unit Data'!$V$3:$W$356,2,FALSE))","v":""},null,false,"",null,{"$f":"IF(G56<>\"\",2,1)","v":1}]
["Performing Arts Production",null,null,null,null,{"$f":"IF(ISERROR(VLOOKUP(G25,'Diploma Unit Data'!$V$3:$X$356,3,FALSE)),\"\",VLOOKUP(G25,'Diploma Unit Data'!$V$3:$X$356,3,FALSE))","v":""},null,{"$f":"IF(ISERROR(VLOOKUP(G25,'Diploma Unit Data'!$V$3:$W$356,2,FALSE)),\"\",VLOOKUP(G25,'Diploma Unit Data'!$V$3:$W$356,2,FALSE))","v":""},null,false,""]
["Public Services",null,null,null,null,{"$f":"IF(ISERROR(VLOOKUP(G26,'Diploma Unit Data'!$V$3:$X$356,3,FALSE)),\"\",VLOOKUP(G26,'Diploma Unit Data'!$V$3:$X$356,3,FALSE))","v":""},null,{"$f":"IF(ISERROR(VLOOKUP(G26,'Diploma Unit Data'!$V$3:$W$356,2,FALSE)),\"\",VLOOKUP(G26,'Diploma Unit Data'!$V$3:$W$356,2,FALSE))","v":""},null,false,""]
["Sport",null,null,null,null,{"$f":"IF(ISERROR(VLOOKUP(G27,'Diploma Unit Data'!$V$3:$X$356,3,FALSE)),\"\",VLOOKUP(G27,'Diploma Unit Data'!$V$3:$X$356,3,FALSE))","v":""},null,{"$f":"IF(ISERROR(VLOOKUP(G27,'Diploma Unit Data'!$V$3:$W$356,2,FALSE)),\"\",VLOOKUP(G27,'Diploma Unit Data'!$V$3:$W$356,2,FALSE))","v":""},null,false,""]
["Sport Outdoor and Adventurous Activities",null,null,null,null,{"$f":"IF(ISERROR(VLOOKUP(G28,'Diploma Unit Data'!$V$3:$X$356,3,FALSE)),\"\",VLOOKUP(G28,'Diploma Unit Data'!$V$3:$X$356,3,FALSE))","v":""},null,{"$f":"IF(ISERROR(VLOOKUP(G28,'Diploma Unit Data'!$V$3:$W$356,2,FALSE)),\"\",VLOOKUP(G28,'Diploma Unit Data'!$V$3:$W$356,2,FALSE))","v":""},null,false,""]
["Sport Fitness and Exercise",null,null,null,null,{"$f":"IF(ISERROR(VLOOKUP(G29,'Diploma Unit Data'!$V$3:$X$356,3,FALSE)),\"\",VLOOKUP(G29,'Diploma Unit Data'!$V$3:$X$356,3,FALSE))","v":""},null,{"$f":"IF(ISERROR(VLOOKUP(G29,'Diploma Unit Data'!$V$3:$W$356,2,FALSE)),\"\",VLOOKUP(G29,'Diploma Unit Data'!$V$3:$W$356,2,FALSE))","v":""},null,false,""]
["Travel and Tourism",null,null,null,null,{"$f":"IF(ISERROR(VLOOKUP(G30,'Diploma Unit Data'!$V$3:$X$356,3,FALSE)),\"\",VLOOKUP(G30,'Diploma Unit Data'!$V$3:$X$356,3,FALSE))","v":""},null,{"$f":"IF(ISERROR(VLOOKUP(G30,'Diploma Unit Data'!$V$3:$W$356,2,FALSE)),\"\",VLOOKUP(G30,'Diploma Unit Data'!$V$3:$W$356,2,FALSE))","v":""},null,false,""]
[null,null,null,null,null,{"$f":"IF(ISERROR(VLOOKUP(G31,'Diploma Unit Data'!$V$3:$X$356,3,FALSE)),\"\",VLOOKUP(G31,'Diploma Unit Data'!$V$3:$X$356,3,FALSE))","v":""},null,{"$f":"IF(ISERROR(VLOOKUP(G31,'Diploma Unit Data'!$V$3:$W$356,2,FALSE)),\"\",VLOOKUP(G31,'Diploma Unit Data'!$V$3:$W$356,2,FALSE))","v":""},null,false,""]
[]
[null,null,null,null,"Optional B",{"$f":"IF(ISERROR(VLOOKUP(G33,'Diploma Unit Data'!$V$3:$X$356,3,FALSE)),\"\",VLOOKUP(G33,'Diploma Unit Data'!$V$3:$X$356,3,FALSE))","v":""},null,{"$f":"IF(ISERROR(VLOOKUP(G33,'Diploma Unit Data'!$V$3:$X$356,2,FALSE)),\"\",VLOOKUP(G33,'Diploma Unit Data'!$V$3:$X$356,2,FALSE))","v":""},null,{"$f":"IF(I33=\"U\",0,IF(I33=\"L1\",2,IF(I33=\"P\",4,IF(I33=\"M\",6,IF(I33=\"D\",8)))))","v":false},{"$f":"IF(ISERROR(IF(I33=\"\",\"\",J33*(H33/10))),\"\",IF(I33=\"\",\"\",J33*(H33/10)))","v":""}]
[null,null,null,null,null,{"$f":"IF(ISERROR(VLOOKUP(G34,'Diploma Unit Data'!$V$3:$X$356,3,FALSE)),\"\",VLOOKUP(G34,'Diploma Unit Data'!$V$3:$X$356,3,FALSE))","v":""},null,{"$f":"IF(ISERROR(VLOOKUP(G34,'Diploma Unit Data'!$V$3:$X$356,2,FALSE)),\"\",VLOOKUP(G34,'Diploma Unit Data'!$V$3:$X$356,2,FALSE))","v":""},null,false,""]
[null,null,null,null,null,{"$f":"IF(ISERROR(VLOOKUP(G35,'Diploma Unit Data'!$V$3:$X$356,3,FALSE)),\"\",VLOOKUP(G35,'Diploma Unit Data'!$V$3:$X$356,3,FALSE))","v":""},null,{"$f":"IF(ISERROR(VLOOKUP(G35,'Diploma Unit Data'!$V$3:$X$356,2,FALSE)),\"\",VLOOKUP(G35,'Diploma Unit Data'!$V$3:$X$356,2,FALSE))","v":""},null,false,""]
[null,null,null,null,null,{"$f":"IF(ISERROR(VLOOKUP(G36,'Diploma Unit Data'!$V$3:$X$356,3,FALSE)),\"\",VLOOKUP(G36,'Diploma Unit Data'!$V$3:$X$356,3,FALSE))","v":""},null,{"$f":"IF(ISERROR(VLOOKUP(G36,'Diploma Unit Data'!$V$3:$X$356,2,FALSE)),\"\",VLOOKUP(G36,'Diploma Unit Data'!$V$3:$X$356,2,FALSE))","v":""},null,false,""]
[null,null,null,null,null,{"$f":"IF(ISERROR(VLOOKUP(G37,'Diploma Unit Data'!$V$3:$X$356,3,FALSE)),\"\",VLOOKUP(G37,'Diploma Unit Data'!$V$3:$X$356,3,FALSE))","v":""},null,{"$f":"IF(ISERROR(VLOOKUP(G37,'Diploma Unit Data'!$V$3:$X$356,2,FALSE)),\"\",VLOOKUP(G37,'Diploma Unit Data'!$V$3:$X$356,2,FALSE))","v":""},null,false,""]
[null,null,null,null,null,{"$f":"IF(ISERROR(VLOOKUP(G38,'Diploma Unit Data'!$V$3:$X$356,3,FALSE)),\"\",VLOOKUP(G38,'Diploma Unit Data'!$V$3:$X$356,3,FALSE))","v":""},null,{"$f":"IF(ISERROR(VLOOKUP(G38,'Diploma Unit Data'!$V$3:$X$356,2,FALSE)),\"\",VLOOKUP(G38,'Diploma Unit Data'!$V$3:$X$356,2,FALSE))","v":""},null,false,""]
[null,null,null,null,null,{"$f":"IF(ISERROR(VLOOKUP(G39,'Diploma Unit Data'!$V$3:$X$356,3,FALSE)),\"\",VLOOKUP(G39,'Diploma Unit Data'!$V$3:$X$356,3,FALSE))","v":""},null,{"$f":"IF(ISERROR(VLOOKUP(G39,'Diploma Unit Data'!$V$3:$X$356,2,FALSE)),\"\",VLOOKUP(G39,'Diploma Unit Data'!$V$3:$X$356,2,FALSE))","v":""},null,false,""]
[null,null,null,null,null,{"$f":"IF(ISERROR(VLOOKUP(G40,'Diploma Unit Data'!$V$3:$X$356,3,FALSE)),\"\",VLOOKUP(G40,'Diploma Unit Data'!$V$3:$X$356,3,FALSE))","v":""},null,{"$f":"IF(ISERROR(VLOOKUP(G40,'Diploma Unit Data'!$V$3:$X$356,2,FALSE)),\"\",VLOOKUP(G40,'Diploma Unit Data'!$V$3:$X$356,2,FALSE))","v":""},null,false,""]
[null,null,null,null,null,null,null,null,null,null,{"$f":"IF(ISERROR(IF(I41=\"\",\"\",J41*(H41/10))),\"\",IF(I41=\"\",\"\",J41*(H41/10)))","v":""}]
[null,null,null,null,"Optional C",{"$f":"IF(ISERROR(VLOOKUP(G42,'Diploma Unit Data'!$V$3:$X$356,3,FALSE)),\"\",VLOOKUP(G42,'Diploma Unit Data'!$V$3:$X$356,3,FALSE))","v":""},null,{"$f":"IF(ISERROR(VLOOKUP(G42,'Diploma Unit Data'!$V$3:$X$356,2,FALSE)),\"\",VLOOKUP(G42,'Diploma Unit Data'!$V$3:$X$356,2,FALSE))","v":""},null,{"$f":"IF(I42=\"U\",0,IF(I42=\"L1\",2,IF(I42=\"P\",4,IF(I42=\"M\",6,IF(I42=\"D\",8)))))","v":false},{"$f":"IF(ISERROR(IF(I42=\"\",\"\",J42*(H42/10))),\"\",IF(I42=\"\",\"\",J42*(H42/10)))","v":""}]
[null,null,null,null,null,{"$f":"IF(ISERROR(VLOOKUP(G43,'Diploma Unit Data'!$V$3:$X$356,3,FALSE)),\"\",VLOOKUP(G43,'Diploma Unit Data'!$V$3:$X$356,3,FALSE))","v":""},null,{"$f":"IF(ISERROR(VLOOKUP(G43,'Diploma Unit Data'!$V$3:$X$356,2,FALSE)),\"\",VLOOKUP(G43,'Diploma Unit Data'!$V$3:$X$356,2,FALSE))","v":""},null,{"$f":"IF(I43=\"U\",0,IF(I43=\"L1\",2,IF(I43=\"P\",4,IF(I43=\"M\",6,IF(I43=\"D\",8)))))","v":false},{"$f":"IF(ISERROR(IF(I43=\"\",\"\",J43*(H43/10))),\"\",IF(I43=\"\",\"\",J43*(H43/10)))","v":""}]
[null,null,null,null,null,{"$f":"IF(ISERROR(VLOOKUP(G44,'Diploma Unit Data'!$V$3:$X$356,3,FALSE)),\"\",VLOOKUP(G44,'Diploma Unit Data'!$V$3:$X$356,3,FALSE))","v":""},null,{"$f":"IF(ISERROR(VLOOKUP(G44,'Diploma Unit Data'!$V$3:$X$356,2,FALSE)),\"\",VLOOKUP(G44,'Diploma Unit Data'!$V$3:$X$356,2,FALSE))","v":""},null,{"$f":"IF(I44=\"U\",0,IF(I44=\"L1\",2,IF(I44=\"P\",4,IF(I44=\"M\",6,IF(I44=\"D\",8)))))","v":false},{"$f":"IF(ISERROR(IF(I44=\"\",\"\",J44*(H44/10))),\"\",IF(I44=\"\",\"\",J44*(H44/10)))","v":""}]
[null,null,null,null,null,{"$f":"IF(ISERROR(VLOOKUP(G45,'Diploma Unit Data'!$V$3:$X$356,3,FALSE)),\"\",VLOOKUP(G45,'Diploma Unit Data'!$V$3:$X$356,3,FALSE))","v":""},null,{"$f":"IF(ISERROR(VLOOKUP(G45,'Diploma Unit Data'!$V$3:$X$356,2,FALSE)),\"\",VLOOKUP(G45,'Diploma Unit Data'!$V$3:$X$356,2,FALSE))","v":""},null,{"$f":"IF(I45=\"U\",0,IF(I45=\"L1\",2,IF(I45=\"P\",4,IF(I45=\"M\",6,IF(I45=\"D\",8)))))","v":false},{"$f":"IF(ISERROR(IF(I45=\"\",\"\",J45*(H45/10))),\"\",IF(I45=\"\",\"\",J45*(H45/10)))","v":""}]
[null,null,null,null,null,{"$f":"IF(ISERROR(VLOOKUP(G46,'Diploma Unit Data'!$V$3:$X$356,3,FALSE)),\"\",VLOOKUP(G46,'Diploma Unit Data'!$V$3:$X$356,3,FALSE))","v":""},null,{"$f":"IF(ISERROR(VLOOKUP(G46,'Diploma Unit Data'!$V$3:$X$356,2,FALSE)),\"\",VLOOKUP(G46,'Diploma Unit Data'!$V$3:$X$356,2,FALSE))","v":""},null,{"$f":"IF(I46=\"U\",0,IF(I46=\"L1\",2,IF(I46=\"P\",4,IF(I46=\"M\",6,IF(I46=\"D\",8)))))","v":false},{"$f":"IF(ISERROR(IF(I46=\"\",\"\",J46*(H46/10))),\"\",IF(I46=\"\",\"\",J46*(H46/10)))","v":""}]
[null,null,null,null,null,null,null,{"$f":"SUM(H9:H46)","v":0}]
[]
[null,null,null,null,null,null,null,null," Points",null,{"$f":"SUM(K9:K42)","v":0},null,{"$f":"IF(ISERROR(IF($G$5=\"Application of Science\", \"\", IF($K9+$K12<24,\"24 points across Core Units required to achieve Level 2\",\"\"))),\"\",IF($G$5=\"Application of Science\", \"\", IF($K9+$K12<24,\"24 points across Core Units required to achieve Level 2\",\"\")))","v":""}]
[null,null,null,null,null,null,null,null," Grade",null,{"$f":"IF(G5=\"\",\"\",IF(G5=\"Information and Creative Technology\",N16,IF(G5=\"Information and Creative Technology Computer Science\",N16,IF(G5=\"Information and Creative Technology Systems Development and Support\",N16,IF(M15=\"U\",\"U\", IF(M15=\"Level 1\", \"Level 1\", M16))))))","v":""},{"$f":"IF(H47>240,1,IF(H47<240,3,2))","v":3}]

{"sheet":"Diploma Validation","index":11,"n_rows":57,"n_cols":255,"rows_kept":57,"cut":false,"hidden":true,"merged":[]}
["Art and Design",null,null,null,"Business A",null,null,null,"CPLD",null,null,null,"Construction A",null,null,null,"CDMP A",null,null,null,"Engineering",null,null,null,"H&SC A",null,null,null,"Hospitality A",null,null,null,"ICT Mand",null,null,null,"ICT A",null,null,null,"Music A",null,null,null,"Performing Arts",null,null,null,"Group B",null,null,null,null,null,null,null,"Performing Arts (Acting)",null,null,null,"Group B",null,null,null,"Group C",null,null,null,"Group B",null,null,null,"Performing Arts (Dance)",null,null,null,"Group B",null,null,null,"Group C",null,null,null,"Performing Arts (Musical Theatre)",null,null,null,"Group B",null,null,null,"Performing Arts (Production)",null,null,null,"Group B",null,null,null,"Sport",null,null,null,"Travel and Tourism",null,null,null,"CDMP Optional B",null,null,null,"A&D Design Crafts",null,null,null,"A&D Fashion & Textiles",null,null,null,"A&D Photography",null,null,null,"A&D Product Design",null,null,null,"A&D Visual Arts",null,null,null,"A&D Visual Communication",null,null,null,"No Optional Group B",null,null,null,"Hospitality B",null,null,null,"Music B",null,null,null,"Applied Science",null,null,null,"Public Services",null,null,null,"Business B",null,null,null,"Construction B",null,null,null,"CDMP B",null,null,null,"CDMP C",null,null,null,"Engineering B",null,null,null,"H&SC B",null,null,null,"ICT B",null,null,null,"ICT Computer Science A",null,null,null,"ICT SD&S A",null,null,null,"Public Services A",null,null,null,"Public Services B",null,null,null,"Sport B",null,null,null,"Sport Outdoor",null,null,null,"Sport Outdoor B",null,null,null,"Sport Fitness",null,null,null,"Sport Fitness B",null,null,null,"Travel and Tourism B",null,null,null,"Engineering Technology",null,null,null,"Engineering Technology B",null,null,null,"Engineering Maintenance",null,null,null,"Engineering Maintenance B",null,null,null,"Engineering Manufacturing",null,null,null,"Engineering Manufacturing B",null,null,null,"Engineering Mechanical",null,null,null,"Engineering Mechanical B"]
[{"$f":"IF(OR(C39=1,C42=1,C45=1),\"\",\"Unit 3 - Communicating Ideas in 2D\")","v":"Unit 3 - Communicating Ideas in 2D"},{"$f":"IF(COUNTIF(Diploma!list1,A2)>=1,\"\",ROW())","v":2},{"$f":"IF(ROW(A2)-ROW(A$2)+1>COUNT(B$2:B$35),\"\",INDEX(A:A,SMALL(B$2:B$35,1+ROW(A2)-ROW(A$2))))","v":"Unit 3 - Communicating Ideas in 2D"},null,"Unit 14 - Business Online",{"$f":"IF(COUNTIF(Diploma!list1,E2)>=1,\"\",ROW())","v":2},{"$f":"IF(ROW(E2)-ROW(E$2)+1>COUNT(F$2:F$12),\"\",INDEX(E:E,SMALL(F$2:F$12,1+ROW(E2)-ROW(E$2))))","v":"Unit 14 - Business Online"},null,"Unit 5 - Health and Safety in Early Years Settings",{"$f":"IF(COUNTIF(Certificate!$G$17:$G$21,I2)>=1,\"\",ROW())","v":2},{"$f":"IF(ROW(I2)-ROW(I$2)+1>COUNT(J$2:J$5),\"\",INDEX(I:I,SMALL(J$2:J$5,1+ROW(I2)-ROW(I$2))))","v":"Unit 5 - Health and Safety in Early Years Settings"},null,{"$f":"IF(OR(P23=1,P26=1,P29=1,P32=1),\"\",\"Unit 16 - Carpentry and Joinery Operations\")","v":"Unit 16 - Carpentry and Joinery Operations"},{"$f":"IF(COUNTIF(Diploma!list1,M2)>=1,\"\",ROW())","v":2},{"$f":"IF(ROW(M2)-ROW(M$2)+1>COUNT(N$2:N$17),\"\",INDEX(M:M,SMALL(N$2:N$17,1+ROW(M2)-ROW(M$2))))","v":"Unit 16 - Carpentry and Joinery Operations"},null,"Unit 3 - Digital Moving Image Production",{"$f":"IF(COUNTIF(Diploma!list1,Q2)>=1,\"\",ROW())","v":2},{"$f":"IF(ROW(Q2)-ROW(Q$2)+1>COUNT(R$2:R$6),\"\",INDEX(Q:Q,SMALL(R$2:R$6,1+ROW(Q2)-ROW(Q$2))))","v":"Unit 3 - Digital Moving Image Production"},null,"Unit 7 - Machining Techniques",{"$f":"IF(COUNTIF(Diploma!list1,U2)>=1,\"\",ROW())","v":2},{"$f":"IF(ROW(U2)-ROW(U$2)+1>COUNT(V$2:V$6),\"\",INDEX(U:U,SMALL(V$2:V$6,1+ROW(U2)-ROW(U$2))))","v":"Unit 7 - Machining Techniques"},null,"Unit 10 - Human Body Systems and Care of Disorders",{"$f":"IF(COUNTIF(Diploma!list1,Y2)>=1,\"\",ROW())","v":2},{"$f":"IF(ROW(Y2)-ROW(Y$2)+1>COUNT(Z$2:Z$9),\"\",INDEX(Y:Y,SMALL(Z$2:Z$9,1+ROW(Y2)-ROW(Y$2))))","v":"Unit 10 - Human Body Systems and Care of Disorders"},null,{"$f":"IF(AND(AF15=1,AF12=0),\"\",\"Unit 4 - Costing and Controlling Finances in the Hospitality Industry\")","v":"Unit 4 - Costing and Controlling Finances in the Hospitality Industry"},{"$f":"IF(COUNTIF(Diploma!list1,AC2)>=1,\"\",ROW())","v":2},{"$f":"IF(ROW(AC2)-ROW(AC$2)+1>COUNT(AD$2:AD$6),\"\",INDEX(AC:AC,SMALL(AD$2:AD$6,1+ROW(AC2)-ROW(AC$2))))","v":"Unit 4 - Costing and Controlling Finances in the Hospitality Industry"},null,"Unit 1 - The Online World",{"$f":"IF(COUNTIF(Certificate!$G$17:$G$21,AG2)>=1,\"\",ROW())","v":2},{"$f":"IF(ROW(AG2)-ROW(AG$2)+1>COUNT(AH$2:AH$3),\"\",INDEX(AG:AG,SMALL(AH$2:AH$3,1+ROW(AG2)-ROW(AG$2))))","v":"Unit 1 - The Online World"},null,"Unit 10 - Database Development",{"$f":"IF(COUNTIF(Diploma!list1,AK2)>=1,\"\",ROW())","v":2},{"$f":"IF(ROW(AK2)-ROW(AK$2)+1>COUNT(AL$2:AL$12),\"\",INDEX(AK:AK,SMALL(AL$2:AL$12,1+ROW(AK2)-ROW(AK$2))))","v":"Unit 10 - Database Development"},null,"Unit 3 - Introducing Live Sound",{"$f":"IF(COUNTIF(Diploma!list1,AO2)>=1,\"\",ROW())","v":2},{"$f":"IF(ROW(AO2)-ROW(AO$2)+1>COUNT(AP$2:AP$8),\"\",INDEX(AO:AO,SMALL(AP$2:AP$8,1+ROW(AO2)-ROW(AO$2))))","v":"Unit 3 - Introducing Live Sound"},null,"Unit 3 - Acting Skills",{"$f":"IF(COUNTIF(Diploma!list1,AS2)>=1,\"\",ROW())","v":2},{"$f":"IF(ROW(AS2)-ROW(AS$2)+1>COUNT(AT$2:AT$6),\"\",INDEX(AS:AS,SMALL(AT$2:AT$6,1+ROW(AS2)-ROW(AS$2))))","v":"Unit 3 - Acting Skills"},null,"Unit 10 - Movement Skills",{"$f":"IF(COUNTIF(list2,AW2)>=1,\"\",ROW())","v":2},{"$f":"IF(ROW(AW2)-ROW(AW$2)+1>COUNT(AX$2:AX$30),\"\",INDEX(AW:AW,SMALL(AX$2:AX$30,1+ROW(AW2)-ROW(AW$2))))","v":"Unit 10 - Movement Skills"},null,"Unit 9 - Performance in Context",{"$f":"IF(COUNTIF(Certificate!$G$23:$G$25,BA2)>=1,\"\",ROW())","v":2},{"$f":"IF(ROW(BA2)-ROW(BA$2)+1>COUNT(BB$2:BB$22),\"\",INDEX(BA:BA,SMALL(BB$2:BB$22,1+ROW(BA2)-ROW(BA$2))))","v":"Unit 9 - Performance in Context"},null,"Unit 11 - Devising Performance Work",{"$f":"IF(COUNTIF(Diploma!list1,BE2)>=1,\"\",ROW())","v":2},{"$f":"IF(ROW(BE2)-ROW(BE$2)+1>COUNT(BF$2:BF$11),\"\",INDEX(BE:BE,SMALL(BF$2:BF$11,1+ROW(BE2)-ROW(BE$2))))","v":"Unit 11 - Devising Performance Work"},null,"Unit 16 - Contemporary Dance Techniques",{"$f":"IF(COUNTIF(list2,BI2)>=1,\"\",ROW())","v":2},{"$f":"IF(ROW(BI2)-ROW(BI$2)+1>COUNT(BJ$2:BJ$10),\"\",INDEX(BI:BI,SMALL(BJ$2:BJ$10,1+ROW(BI2)-ROW(BI$2))))","v":"Unit 16 - Contemporary Dance Techniques"},null,"Unit 19 - Design Planning for Performance",{"$f":"IF(COUNTIF('Extended Certificate'!$G$39,BM2)>=1,\"\",ROW())","v":2},{"$f":"IF(ROW(BM2)-ROW(BM$2)+1>COUNT(BN$2:BN$10),\"\",INDEX(BM:BM,SMALL(BN$2:BN$10,1+ROW(BM2)-ROW(BM$2))))","v":"Unit 19 - Design Planning for Performance"},null,"Only one optional unit from Group B permitted",{"$f":"IF(COUNTIF(Certificate!$G$23:$G$23,BQ2)>=1,\"\",ROW())","v":2},"Only one optional unit from Group B permitted",null,"Unit 10 - Movement Skills",{"$f":"IF(COUNTIF(Diploma!list1,BU2)>=1,\"\",ROW())","v":2},{"$f":"IF(ROW(BU2)-ROW(BU$2)+1>COUNT(BV$2:BV$12),\"\",INDEX(BU:BU,SMALL(BV$2:BV$12,1+ROW(BU2)-ROW(BU$2))))","v":"Unit 10 - Movement Skills"},null,"Unit 14 - Voice and Speech for Performers",{"$f":"IF(COUNTIF(list2,BY2)>=1,\"\",ROW())","v":2},{"$f":"IF(ROW(BY2)-ROW(BY$2)+1>COUNT(BZ$2:BZ$8),\"\",INDEX(BY:BY,SMALL(BZ$2:BZ$8,1+ROW(BY2)-ROW(BY$2))))","v":"Unit 14 - Voice and Speech for Performers"},null,"Unit 19 - Design Planning for Performance",{"$f":"IF(COUNTIF('Extended Certificate'!$G$39,CC2)>=1,\"\",ROW())","v":2},{"$f":"IF(ROW(CC2)-ROW(CC$2)+1>COUNT(CD$2:CD$10),\"\",INDEX(CC:CC,SMALL(CD$2:CD$10,1+ROW(CC2)-ROW(CC$2))))","v":"Unit 19 - Design Planning for Performance"},null,"Unit 9 - Performance in Context",{"$f":"IF(COUNTIF('Extended Certificate'!$G$21:$G$29,CG2)>=1,\"\",ROW())","v":2},{"$f":"IF(ROW(CG2)-ROW(CG$2)+1>COUNT(CH$2:CH$6),\"\",INDEX(CG:CG,SMALL(CH$2:CH$6,1+ROW(CG2)-ROW(CG$2))))","v":"Unit 9 - Performance in Context"},null,"Unit 15 - Performing Scripted Plays",{"$f":"IF(COUNTIF(Certificate!$G$23:$G$25,CK2)>=1,\"\",ROW())","v":2},{"$f":"IF(ROW(CK2)-ROW(CK$2)+1>COUNT(CL$2:CL$14),\"\",INDEX(CK:CK,SMALL(CL$2:CL$14,1+ROW(CK2)-ROW(CK$2))))","v":"Unit 15 - Performing Scripted Plays"},null,"Unit 19 - Design Planning for Performance",{"$f":"IF(COUNTIF(Diploma!list1,CO2)>=1,\"\",ROW())","v":2},{"$f":"IF(ROW(CO2)-ROW(CO$2)+1>COUNT(CP$2:CP$16),\"\",INDEX(CO:CO,SMALL(CP$2:CP$16,1+ROW(CO2)-ROW(CO$2))))","v":"Unit 19 - Design Planning for Performance"},null,"Unit 11 - Devising Performance Work",{"$f":"IF(COUNTIF(list2,CS2)>=1,\"\",ROW())","v":2},{"$f":"IF(ROW(CS2)-ROW(CS$2)+1>COUNT(CT$2:CT$5),\"\",INDEX(CS:CS,SMALL(CT$2:CT$5,1+ROW(CS2)-ROW(CS$2))))","v":"Unit 11 - Devising Performance Work"},null,"Unit 15 - Designing Exercise Programmes",{"$f":"IF(COUNTIF(Diploma!list1,CW2)>=1,\"\",ROW())","v":2},{"$f":"IF(ROW(CW2)-ROW(CW$2)+1>COUNT(CX$2:CX$9),\"\",INDEX(CW:CW,SMALL(CX$2:CX$9,1+ROW(CW2)-ROW(CW$2))))","v":"Unit 15 - Designing Exercise Programmes"},null,"Unit 12 - Marketing in Travel and Tourism",{"$f":"IF(COUNTIF(Diploma!list1,DA2)>=1,\"\",ROW())","v":2},{"$f":"IF(ROW(DA2)-ROW(DA$2)+1>COUNT(DB$2:DB$5),\"\",INDEX(DA:DA,SMALL(DB$2:DB$5,1+ROW(DA2)-ROW(DA$2))))","v":"Unit 12 - Marketing in Travel and Tourism"},null,"Unit 9 - Digital Editing for Moving Image",{"$f":"IF(COUNTIF('Extended Certificate'!$G$31:$G$37,DE2)>=1,\"\",ROW())","v":2},{"$f":"IF(ROW(DE2)-ROW(DE$2)+1>COUNT(DF$2:DF$11),\"\",INDEX(DE:DE,SMALL(DF$2:DF$11,1+ROW(DE2)-ROW(DE$2))))","v":"Unit 9 - Digital Editing for Moving Image"},null,"Unit 3 - Communicating Ideas in 2D",{"$f":"IF(COUNTIF(Diploma!list1,DI2)>=1,\"\",ROW())","v":2},{"$f":"IF(ROW(DI2)-ROW(DI$2)+1>COUNT(DJ$2:DJ$12),\"\",INDEX(DI:DI,SMALL(DJ$2:DJ$12,1+ROW(DI2)-ROW(DI$2))))","v":"Unit 3 - Communicating Ideas in 2D"},null,"Unit 3 - Communicating Ideas in 2D",{"$f":"IF(COUNTIF(Diploma!list1,DM2)>=1,\"\",ROW())","v":2},{"$f":"IF(ROW(DM2)-ROW(DM$2)+1>COUNT(DN$2:DN$14),\"\",INDEX(DM:DM,SMALL(DN$2:DN$14,1+ROW(DM2)-ROW(DM$2))))","v":"Unit 3 - Communicating Ideas in 2D"},null,"Unit 3 - Communicating Ideas in 2D",{"$f":"IF(COUNTIF(Diploma!list1,DQ2)>=1,\"\",ROW())","v":2},{"$f":"IF(ROW(DQ2)-ROW(DQ$2)+1>COUNT(DR$2:DR$12),\"\",INDEX(DQ:DQ,SMALL(DR$2:DR$12,1+ROW(DQ2)-ROW(DQ$2))))","v":"Unit 3 - Communicating Ideas in 2D"},null,{"$f":"IF(DW21=1,\"\",\"Unit 3 - Communicating Ideas in 2D\")","v":"Unit 3 - Communicating Ideas in 2D"},{"$f":"IF(COUNTIF(Diploma!list1,DU2)>=1,\"\",ROW())","v":2},{"$f":"IF(ROW(DU2)-ROW(DU$2)+1>COUNT(DV$2:DV$18),\"\",INDEX(DU:DU,SMALL(DV$2:DV$18,1+ROW(DU2)-ROW(DU$2))))","v":"Unit 3 - Communicating Ideas in 2D"},null,"Unit 8 - Using Mobile Devices in Art and Design",{"$f":"IF(COUNTIF(Diploma!list1,DY2)>=1,\"\",ROW())","v":2},{"$f":"IF(ROW(DY2)-ROW(DY$2)+1>COUNT(DZ$2:DZ$13),\"\",INDEX(DY:DY,SMALL(DZ$2:DZ$13,1+ROW(DY2)-ROW(DY$2))))","v":"Unit 8 - Using Mobile Devices in Art and Design"},null,"Unit 4 - Communicating Ideas in 3D",{"$f":"IF(COUNTIF(Diploma!list1,EC2)>=1,\"\",ROW())","v":2},{"$f":"IF(ROW(EC2)-ROW(EC$2)+1>COUNT(ED$2:ED$16),\"\",INDEX(EC:EC,SMALL(ED$2:ED$16,1+ROW(EC2)-ROW(EC$2))))","v":"Unit 4 - Communicating Ideas in 3D"},null,"N/A",{"$f":"IF(COUNTIF(Certificate!$G$17:$G$21,EG2)>=1,\"\",ROW())","v":2},"N/A",null,{"$f":"IF(OR(AF15=1,AF12=1),\"\",\"Unit 5 - Enterprise in the Hospitality Industry\")","v":"Unit 5 - Enterprise in the Hospitality Industry"},{"$f":"IF(COUNTIF(list2,EK2)>=1,\"\",ROW())","v":2},{"$f":"IF(ROW(EK2)-ROW(EK$2)+1>COUNT(EL$2:EL$13),\"\",INDEX(EK:EK,SMALL(EL$2:EL$13,1+ROW(EK2)-ROW(EK$2))))","v":"Unit 5 - Enterprise in the Hospitality Industry"},null,"Unit 11 - Developing Solo Music Performance",{"$f":"IF(COUNTIF(list2,EO2)>=1,\"\",ROW())","v":2},{"$f":"IF(ROW(EO2)-ROW(EO$2)+1>COUNT(EP$2:EP$16),\"\",INDEX(EO:EO,SMALL(EP$2:EP$16,1+ROW(EO2)-ROW(EO$2))))","v":"Unit 11 - Developing Solo Music Performance"},null,"Unit 9 - Practical Scientific Project ",{"$f":"IF(COUNTIF('Extended Certificate'!$G$21:$G$29,ES2)>=1,\"\",ROW())","v":2},{"$f":"IF(ROW(ES2)-ROW(ES$2)+1>COUNT(ET$2:ET$17),\"\",INDEX(ES:ES,SMALL(ET$2:ET$17,1+ROW(ES2)-ROW(ES$2))))","v":"Unit 9 - Practical Scientific Project "},null,"Unit 3 - Employment in the Public Services",{"$f":"IF(COUNTIF('Extended Certificate'!$G$21:$G$29,EW2)>=1,\"\",ROW())","v":2},{"$f":"IF(ROW(EW2)-ROW(EW$2)+1>COUNT(EX$2:EX$15),\"\",INDEX(EW:EW,SMALL(EX$2:EX$15,1+ROW(EW2)-ROW(EW$2))))","v":"Unit 3 - Employment in the Public Services"},null,"Unit 5 - Sales and Personal Selling",{"$f":"IF(COUNTIF(list2,FA2)>=1,\"\",ROW())","v":2},{"$f":"IF(ROW(FA2)-ROW(FA$2)+1>COUNT(FB$2:FB$11),\"\",INDEX(FA:FA,SMALL(FB$2:FB$11,1+ROW(FA2)-ROW(FA$2))))","v":"Unit 5 - Sales and Personal Selling"},null,{"$f":"IF(OR(P20=1,P23=1,P26=1,P29=1,P32=1),\"\",\"Unit 5 - Construction Drawing Techniques\")","v":"Unit 5 - Construction Drawing Techniques"},{"$f":"IF(COUNTIF(list2,FE2)>=1,\"\",ROW())","v":2},{"$f":"IF(ROW(FE2)-ROW(FE$2)+1>COUNT(FF$2:FF$14),\"\",INDEX(FE:FE,SMALL(FF$2:FF$14,1+ROW(FE2)-ROW(FE$2))))","v":"Unit 5 - Construction Drawing Techniques"},null,"Unit 9 - Digital Editing for Moving Image",{"$f":"IF(COUNTIF(list2,FI2)>=1,\"\",ROW())","v":2},{"$f":"IF(ROW(FI2)-ROW(FI$2)+1>COUNT(FJ$2:FJ$6),\"\",INDEX(FI:FI,SMALL(FJ$2:FJ$6,1+ROW(FI2)-ROW(FI$2))))","v":"Unit 9 - Digital Editing for Moving Image"},null,"Unit 12 - Digital Audio Editing",{"$f":"IF(COUNTIF(list3,FM2)>=1,\"\",ROW())","v":2},{"$f":"IF(ROW(FM2)-ROW(FM$2)+1>COUNT(FN$2:FN$8),\"\",INDEX(FM:FM,SMALL(FN$2:FN$8,1+ROW(FM2)-ROW(FM$2))))","v":"Unit 12 - Digital Audio Editing"},null,"Unit 4 - Engineering Maintenance",{"$f":"IF(COUNTIF(list2,FQ2)>=1,\"\",ROW())","v":2},{"$f":"IF(ROW(FQ2)-ROW(FQ$2)+1>COUNT(FR$2:FR$24),\"\",INDEX(FQ:FQ,SMALL(FR$2:FR$24,1+ROW(FQ2)-ROW(FQ$2))))","v":"Unit 4 - Engineering Maintenance"},null,"Unit 4 - Social Influences on Health and Wellbeing",{"$f":"IF(COUNTIF(list2,FU2)>=1,\"\",ROW())","v":2},{"$f":"IF(ROW(FU2)-ROW(FU$2)+1>COUNT(FV$2:FV$9),\"\",INDEX(FU:FU,SMALL(FV$2:FV$9,1+ROW(FU2)-ROW(FU$2))))","v":"Unit 4 - Social Influences on Health and Wellbeing"},null,"Unit 4 - Creating Digital Animation",{"$f":"IF(COUNTIF(list2,FY2)>=1,\"\",ROW())","v":2},{"$f":"IF(ROW(FY2)-ROW(FY$2)+1>COUNT(FZ$2:FZ$9),\"\",INDEX(FY:FY,SMALL(FZ$2:FZ$9,1+ROW(FY2)-ROW(FY$2))))","v":"Unit 4 - Creating Digital Animation"},null,"Unit 4 - Creating Digital Animation",{"$f":"IF(COUNTIF(Diploma!list1,GC2)>=1,\"\",ROW())","v":2},{"$f":"IF(ROW(GC2)-ROW(GC$2)+1>COUNT(GD$2:GD$17),\"\",INDEX(GC:GC,SMALL(GD$2:GD$17,1+ROW(GC2)-ROW(GC$2))))","v":"Unit 4 - Creating Digital Animation"},null,"Unit 4 - Creating Digital Animation",{"$f":"IF(COUNTIF(Diploma!list1,GG2)>=1,\"\",ROW())","v":2},{"$f":"IF(ROW(GG2)-ROW(GG$2)+1>COUNT(GH$2:GH$17),\"\",INDEX(GG:GG,SMALL(GH$2:GH$17,1+ROW(GG2)-ROW(GG$2))))","v":"Unit 4 - Creating Digital Animation"},null,"Unit 12 - Land Navigation by Map and Compass",{"$f":"IF(COUNTIF(Diploma!list1,GK2)>=1,\"\",ROW())","v":2},{"$f":"IF(ROW(GK2)-ROW(GK$2)+1>COUNT(GL$2:GL$7),\"\",INDEX(GK:GK,SMALL(GL$2:GL$7,1+ROW(GK2)-ROW(GK$2))))","v":"Unit 12 - Land Navigation by Map and Compass"},null,"Unit 3 - Employment in the Public Services",{"$f":"IF(COUNTIF(list2,GO2)>=1,\"\",ROW())","v":2},{"$f":"IF(ROW(GO2)-ROW(GO$2)+1>COUNT(GP$2:GP$9),\"\",INDEX(GO:GO,SMALL(GP$2:GP$9,1+ROW(GO2)-ROW(GO$2))))","v":"Unit 3 - Employment in the Public Services"},null,"Unit 6 - Leading Sports Activities",{"$f":"IF(COUNTIF(list2,GS2)>=1,\"\",ROW())","v":2},{"$f":"IF(ROW(GS2)-ROW(GS$2)+1>COUNT(GT$2:GT$10),\"\",INDEX(GS:GS,SMALL(GT$2:GT$10,1+ROW(GS2)-ROW(GS$2))))","v":"Unit 6 - Leading Sports Activities"},null,"Unit 18 - Expedition Experience",{"$f":"IF(COUNTIF(Diploma!list1,GW2)>=1,\"\",ROW())","v":2},{"$f":"IF(ROW(GW2)-ROW(GW$2)+1>COUNT(GX$2:GX$6),\"\",INDEX(GW:GW,SMALL(GX$2:GX$6,1+ROW(GW2)-ROW(GW$2))))","v":"Unit 18 - Expedition Experience"},null,"Unit 6 - Leading Sports Activities",{"$f":"IF(COUNTIF(list2,HA2)>=1,\"\",ROW())","v":2},{"$f":"IF(ROW(HA2)-ROW(HA$2)+1>COUNT(HB$2:HB$13),\"\",INDEX(HA:HA,SMALL(HB$2:HB$13,1+ROW(HA2)-ROW(HA$2))))","v":"Unit 6 - Leading Sports Activities"},null,"Unit 17 - Facility Operations for Sport and Leisure",{"$f":"IF(COUNTIF(Diploma!list1,HE2)>=1,\"\",ROW())","v":2},{"$f":"IF(ROW(HE2)-ROW(HE$2)+1>COUNT(HF$2:HF$3),\"\",INDEX(HE:HE,SMALL(HF$2:HF$3,1+ROW(HE2)-ROW(HE$2))))","v":"Unit 17 - Facility Operations for Sport and Leisure"},null,"Unit 6 - Leading Sports Activities",{"$f":"IF(COUNTIF(list2,HI2)>=1,\"\",ROW())","v":2},{"$f":"IF(ROW(HI2)-ROW(HI$2)+1>COUNT(HJ$2:HJ$8),\"\",INDEX(HI:HI,SMALL(HJ$2:HJ$8,1+ROW(HI2)-ROW(HI$2))))","v":"Unit 6 - Leading Sports Activities"},null,"Unit 8 - Promotion and Sales in Travel and Tourism",{"$f":"IF(COUNTIF(list2,HM2)>=1,\"\",ROW())","v":2},{"$f":"IF(ROW(HM2)-ROW(HM$2)+1>COUNT(HN$2:HN$10),\"\",INDEX(HM:HM,SMALL(HN$2:HN$10,1+ROW(HM2)-ROW(HM$2))))","v":"Unit 8 - Promotion and Sales in Travel and Tourism"},null,"Unit 23 - Electronic Devices and Communication Applications",{"$f":"IF(COUNTIF(Diploma!list1,HQ2)>=1,\"\",ROW())","v":2},{"$f":"IF(ROW(HQ2)-ROW(HQ$2)+1>COUNT(HR$2:HR$10),\"\",INDEX(HQ:HQ,SMALL(HR$2:HR$10,1+ROW(HQ2)-ROW(HQ$2))))","v":"Unit 23 - Electronic Devices and Communication Applications"},null,"Unit 4 - Engineering Maintenance",{"$f":"IF(COUNTIF(list2,HU2)>=1,\"\",ROW())","v":2},{"$f":"IF(ROW(HU2)-ROW(HU$2)+1>COUNT(HV$2:HV$8),\"\",INDEX(HU:HU,SMALL(HV$2:HV$8,1+ROW(HU2)-ROW(HU$2))))","v":"Unit 4 - Engineering Maintenance"},null,"Unit 24 - Operation and Maintenance of Mechanical Systems and Components",{"$f":"IF(COUNTIF(Diploma!list1,HY2)>=1,\"\",ROW())","v":2},{"$f":"IF(ROW(HY2)-ROW(HY$2)+1>COUNT(HZ$2:HZ$5),\"\",INDEX(HY:HY,SMALL(HZ$2:HZ$5,1+ROW(HY2)-ROW(HY$2))))","v":"Unit 24 - Operation and Maintenance of Mechanical Systems and Components"},null,"Unit 8 - Electronic Circuit Design and Construction",{"$f":"IF(COUNTIF(list2,IC2)>=1,\"\",ROW())","v":2},{"$f":"IF(ROW(IC2)-ROW(IC$2)+1>COUNT(ID$2:ID$8),\"\",INDEX(IC:IC,SMALL(ID$2:ID$8,1+ROW(IC2)-ROW(IC$2))))","v":"Unit 8 - Electronic Circuit Design and Construction"},null,"Unit 15 - Operating an Efficient Workplace",{"$f":"IF(COUNTIF(Diploma!list1,IG2)>=1,\"\",ROW())","v":2},{"$f":"IF(ROW(IG2)-ROW(IG$2)+1>COUNT(IH$2:IH$4),\"\",INDEX(IG:IG,SMALL(IH$2:IH$4,1+ROW(IG2)-ROW(IG$2))))","v":"Unit 15 - Operating an Efficient Workplace"},null,"Unit 4 - Engineering Maintenance",{"$f":"IF(COUNTIF(list2,IK2)>=1,\"\",ROW())","v":2},{"$f":"IF(ROW(IK2)-ROW(IK$2)+1>COUNT(IL$2:IL$13),\"\",INDEX(IK:IK,SMALL(IL$2:IL$13,1+ROW(IK2)-ROW(IK$2))))","v":"Unit 4 - Engineering Maintenance"},null,"Unit 7 - Machining Techniques",{"$f":"IF(COUNTIF(Diploma!list1,IO2)>=1,\"\",ROW())","v":2},{"$f":"IF(ROW(IO2)-ROW(IO$2)+1>COUNT(IP$2:IP$4),\"\",INDEX(IO:IO,SMALL(IP$2:IP$4,1+ROW(IO2)-ROW(IO$2))))","v":"Unit 7 - Machining Techniques"},null,"Unit 4 - Engineering Maintenance",{"$f":"IF(COUNTIF(list2,IS2)>=1,\"\",ROW())","v":2},{"$f":"IF(ROW(IS2)-ROW(IS$2)+1>COUNT(IT$2:IT$12),\"\",INDEX(IS:IS,SMALL(IT$2:IT$12,1+ROW(IS2)-ROW(IS$2))))","v":"Unit 4 - Engineering Maintenance"}]
[{"$f":"IF(OR(C48=1,C42=1,C51=1,C54=1,C57=1),\"\",\"Unit 4 - Communicating Ideas in 3D\")","v":"Unit 4 - Communicating Ideas in 3D"},{"$f":"IF(COUNTIF(Diploma!list1,A3)>=1,\"\",ROW())","v":3},{"$f":"IF(ROW(A3)-ROW(A$2)+1>COUNT(B$2:B$35),\"\",INDEX(A:A,SMALL(B$2:B$35,1+ROW(A3)-ROW(A$2))))","v":"Unit 4 - Communicating Ideas in 3D"},null,"Unit 20 - Delivering and Improving Customer Service",{"$f":"IF(COUNTIF(Diploma!list1,E3)>=1,\"\",ROW())","v":3},{"$f":"IF(ROW(E3)-ROW(E$2)+1>COUNT(F$2:F$12),\"\",INDEX(E:E,SMALL(F$2:F$12,1+ROW(E3)-ROW(E$2))))","v":"Unit 20 - Delivering and Improving Customer Service"},null,"Unit 6 - Supporting Children’s Language and Literacy Development",{"$f":"IF(COUNTIF(Certificate!$G$17:$G$21,I3)>=1,\"\",ROW())","v":3},{"$f":"IF(ROW(I3)-ROW(I$2)+1>COUNT(J$2:J$5),\"\",INDEX(I:I,SMALL(J$2:J$5,1+ROW(I3)-ROW(I$2))))","v":"Unit 6 - Supporting Children’s Language and Literacy Development"},null,{"$f":"IF(OR(P20=1,P26=1,P29=1,P32=1),\"\",\"Unit 17 - Brickwork and Blockwork Operations\")","v":"Unit 17 - Brickwork and Blockwork Operations"},{"$f":"IF(COUNTIF(Diploma!list1,M3)>=1,\"\",ROW())","v":3},{"$f":"IF(ROW(M3)-ROW(M$2)+1>COUNT(N$2:N$17),\"\",INDEX(M:M,SMALL(N$2:N$17,1+ROW(M3)-ROW(M$2))))","v":"Unit 17 - Brickwork and Blockwork Operations"},null,"Unit 4 - Digital Audio Production",{"$f":"IF(COUNTIF(Diploma!list1,Q3)>=1,\"\",ROW())","v":3},{"$f":"IF(ROW(Q3)-ROW(Q$2)+1>COUNT(R$2:R$6),\"\",INDEX(Q:Q,SMALL(R$2:R$6,1+ROW(Q3)-ROW(Q$2))))","v":"Unit 4 - Digital Audio Production"},null,"Unit 8 - Electronic Circuit Design and Construction",{"$f":"IF(COUNTIF(Diploma!list1,U3)>=1,\"\",ROW())","v":3},{"$f":"IF(ROW(U3)-ROW(U$2)+1>COUNT(V$2:V$6),\"\",INDEX(U:U,SMALL(V$2:V$6,1+ROW(U3)-ROW(U$2))))","v":"Unit 8 - Electronic Circuit Design and Construction"},null,"Unit 12 - Creative and Therapeutic Activities in Health and Social Care",{"$f":"IF(COUNTIF(Diploma!list1,Y3)>=1,\"\",ROW())","v":3},{"$f":"IF(ROW(Y3)-ROW(Y$2)+1>COUNT(Z$2:Z$9),\"\",INDEX(Y:Y,SMALL(Z$2:Z$9,1+ROW(Y3)-ROW(Y$2))))","v":"Unit 12 - Creative and Therapeutic Activities in Health and Social Care"},null,{"$f":"IF(AND(AF15=0,AF12=1),\"\",\"Unit 6 - Planning, Preparing, Cooking and Finishing Food\")","v":"Unit 6 - Planning, Preparing, Cooking and Finishing Food"},{"$f":"IF(COUNTIF(Diploma!list1,AC3)>=1,\"\",ROW())","v":3},{"$f":"IF(ROW(AC3)-ROW(AC$2)+1>COUNT(AD$2:AD$6),\"\",INDEX(AC:AC,SMALL(AD$2:AD$6,1+ROW(AC3)-ROW(AC$2))))","v":"Unit 6 - Planning, Preparing, Cooking and Finishing Food"},null,"Unit 2 - Technology Systems",{"$f":"IF(COUNTIF(Certificate!$G$17:$G$21,AG3)>=1,\"\",ROW())","v":3},{"$f":"IF(ROW(AG3)-ROW(AG$2)+1>COUNT(AH$2:AH$3),\"\",INDEX(AG:AG,SMALL(AH$2:AH$3,1+ROW(AG3)-ROW(AG$2))))","v":"Unit 2 - Technology Systems"},null,"Unit 11 - Computer Networks",{"$f":"IF(COUNTIF(Diploma!list1,AK3)>=1,\"\",ROW())","v":3},{"$f":"IF(ROW(AK3)-ROW(AK$2)+1>COUNT(AL$2:AL$12),\"\",INDEX(AK:AK,SMALL(AL$2:AL$12,1+ROW(AK3)-ROW(AK$2))))","v":"Unit 11 - Computer Networks"},null,"Unit 4 - Introducing Music Composition",{"$f":"IF(COUNTIF(Diploma!list1,AO3)>=1,\"\",ROW())","v":3},{"$f":"IF(ROW(AO3)-ROW(AO$2)+1>COUNT(AP$2:AP$8),\"\",INDEX(AO:AO,SMALL(AP$2:AP$8,1+ROW(AO3)-ROW(AO$2))))","v":"Unit 4 - Introducing Music Composition"},null,"Unit 4 - Dance Skills",{"$f":"IF(COUNTIF(Diploma!list1,AS3)>=1,\"\",ROW())","v":3},{"$f":"IF(ROW(AS3)-ROW(AS$2)+1>COUNT(AT$2:AT$6),\"\",INDEX(AS:AS,SMALL(AT$2:AT$6,1+ROW(AS3)-ROW(AS$2))))","v":"Unit 4 - Dance Skills"},null,"Unit 11 - Devising Performance Work",3,{"$f":"IF(ROW(AW3)-ROW(AW$2)+1>COUNT(AX$2:AX$30),\"\",INDEX(AW:AW,SMALL(AX$2:AX$30,1+ROW(AW3)-ROW(AW$2))))","v":"Unit 11 - Devising Performance Work"},null,"Unit 10 - Movement Skills",{"$f":"IF(COUNTIF(Certificate!$G$23:$G$25,BA3)>=1,\"\",ROW())","v":3},"Unit 10 - Movement Skills",null,"Unit 12 - Exploring Improvisation",{"$f":"IF(COUNTIF(Diploma!list1,BE3)>=1,\"\",ROW())","v":3},{"$f":"IF(ROW(BE3)-ROW(BE$2)+1>COUNT(BF$2:BF$11),\"\",INDEX(BE:BE,SMALL(BF$2:BF$11,1+ROW(BE3)-ROW(BE$2))))","v":"Unit 12 - Exploring Improvisation"},null,"Unit 17 - Exploring Urban Dance Styles",3,{"$f":"IF(ROW(BI3)-ROW(BI$2)+1>COUNT(BJ$2:BJ$10),\"\",INDEX(BI:BI,SMALL(BJ$2:BJ$10,1+ROW(BI3)-ROW(BI$2))))","v":"Unit 17 - Exploring Urban Dance Styles"},null,"Unit 20 - Realising Costume Design for Performance",{"$f":"IF(COUNTIF('Extended Certificate'!$G$39,BM3)>=1,\"\",ROW())","v":3},"Unit 20 - Realising Costume Design for Performance",null,null,null,null,null,"Unit 11 - Devising Performance Work",{"$f":"IF(COUNTIF(Diploma!list1,BU3)>=1,\"\",ROW())","v":3},{"$f":"IF(ROW(BU3)-ROW(BU$2)+1>COUNT(BV$2:BV$12),\"\",INDEX(BU:BU,SMALL(BV$2:BV$12,1+ROW(BU3)-ROW(BU$2))))","v":"Unit 11 - Devising Performance Work"},null,"Unit 15 - Performing Scripted Plays",3,{"$f":"IF(ROW(BY3)-ROW(BY$2)+1>COUNT(BZ$2:BZ$8),\"\",INDEX(BY:BY,SMALL(BZ$2:BZ$8,1+ROW(BY3)-ROW(BY$2))))","v":"Unit 15 - Performing Scripted Plays"},null,"Unit 20 - Realising Costume Design for Performance",{"$f":"IF(COUNTIF('Extended Certificate'!$G$39,CC3)>=1,\"\",ROW())","v":3},{"$f":"IF(ROW(CC3)-ROW(CC$2)+1>COUNT(CD$2:CD$10),\"\",INDEX(CC:CC,SMALL(CD$2:CD$10,1+ROW(CC3)-ROW(CC$2))))","v":"Unit 20 - Realising Costume Design for Performance"},null,"Unit 10 - Movement Skills",{"$f":"IF(COUNTIF('Extended Certificate'!$G$21:$G$29,CG3)>=1,\"\",ROW())","v":3},{"$f":"IF(ROW(CG3)-ROW(CG$2)+1>COUNT(CH$2:CH$6),\"\",INDEX(BE:BE,SMALL(CH$2:CH$6,1+ROW(CG3)-ROW(CG$2))))","v":"Unit 12 - Exploring Improvisation"},null,"Unit 16 - Contemporary Dance Techniques",{"$f":"IF(COUNTIF(Certificate!$G$23:$G$25,CK3)>=1,\"\",ROW())","v":3},"Unit 16 - Contemporary Dance Techniques",null,"Unit 20 - Realising Costume Design for Performance",{"$f":"IF(COUNTIF(Diploma!list1,CO3)>=1,\"\",ROW())","v":3},{"$f":"IF(ROW(CO3)-ROW(CO$2)+1>COUNT(CP$2:CP$16),\"\",INDEX(CO:CO,SMALL(CP$2:CP$16,1+ROW(CO3)-ROW(CO$2))))","v":"Unit 20 - Realising Costume Design for Performance"},null,"Unit 13 - Multimedia Performance",{"$f":"IF(COUNTIF(list2,CS3)>=1,\"\",ROW())","v":3},{"$f":"IF(ROW(CS3)-ROW(CS$2)+1>COUNT(CT$2:CT$5),\"\",INDEX(CS:CS,SMALL(CT$2:CT$5,1+ROW(CS3)-ROW(CS$2))))","v":"Unit 13 - Multimedia Performance"},null,"Unit 17 - Facility Operations for Sport and Leisure",{"$f":"IF(COUNTIF(Diploma!list1,CW3)>=1,\"\",ROW())","v":3},{"$f":"IF(ROW(CW3)-ROW(CW$2)+1>COUNT(CX$2:CX$9),\"\",INDEX(CW:CW,SMALL(CX$2:CX$9,1+ROW(CW3)-ROW(CW$2))))","v":"Unit 17 - Facility Operations for Sport and Leisure"},null,"Unit 13 - Airports and Airlines",{"$f":"IF(COUNTIF(Diploma!list1,DA3)>=1,\"\",ROW())","v":3},{"$f":"IF(ROW(DA3)-ROW(DA$2)+1>COUNT(DB$2:DB$5),\"\",INDEX(DA:DA,SMALL(DB$2:DB$5,1+ROW(DA3)-ROW(DA$2))))","v":"Unit 13 - Airports and Airlines"},null,"Unit 10 - Digital Photography for a Media Product",{"$f":"IF(COUNTIF('Extended Certificate'!$G$31:$G$37,DE3)>=1,\"\",ROW())","v":3},{"$f":"IF(ROW(DE3)-ROW(DE$2)+1>COUNT(DF$2:DF$11),\"\",INDEX(DE:DE,SMALL(DF$2:DF$11,1+ROW(DE3)-ROW(DE$2))))","v":"Unit 10 - Digital Photography for a Media Product"},null,"Unit 17 - Art, Craft and Design in the Creative Industries",{"$f":"IF(COUNTIF(Diploma!list1,DI3)>=1,\"\",ROW())","v":3},{"$f":"IF(ROW(DI3)-ROW(DI$2)+1>COUNT(DJ$2:DJ$12),\"\",INDEX(DI:DI,SMALL(DJ$2:DJ$12,1+ROW(DI3)-ROW(DI$2))))","v":"Unit 17 - Art, Craft and Design in the Creative Industries"},null,"Unit 9 - Design Crafts Briefs",{"$f":"IF(COUNTIF(Diploma!list1,DM3)>=1,\"\",ROW())","v":3},{"$f":"IF(ROW(DM3)-ROW(DM$2)+1>COUNT(DN$2:DN$14),\"\",INDEX(DM:DM,SMALL(DN$2:DN$14,1+ROW(DM3)-ROW(DM$2))))","v":"Unit 9 - Design Crafts Briefs"},null,"Unit 4 - Communicating Ideas in 3D",{"$f":"IF(COUNTIF(Diploma!list1,DQ3)>=1,\"\",ROW())","v":3},{"$f":"IF(ROW(DQ3)-ROW(DQ$2)+1>COUNT(DR$2:DR$12),\"\",INDEX(DQ:DQ,SMALL(DR$2:DR$12,1+ROW(DQ3)-ROW(DQ$2))))","v":"Unit 4 - Communicating Ideas in 3D"},null,{"$f":"IF(OR(DW24=1,DW27=1),\"\",\"Unit 4 - Communicating Ideas in 3D\")","v":"Unit 4 - Communicating Ideas in 3D"},{"$f":"IF(COUNTIF(Diploma!list1,DU3)>=1,\"\",ROW())","v":3},{"$f":"IF(ROW(DU3)-ROW(DU$2)+1>COUNT(DV$2:DV$18),\"\",INDEX(DU:DU,SMALL(DV$2:DV$18,1+ROW(DU3)-ROW(DU$2))))","v":"Unit 4 - Communicating Ideas in 3D"},null,"Unit 14 - Photography Briefs",{"$f":"IF(COUNTIF(Diploma!list1,DY3)>=1,\"\",ROW())","v":3},{"$f":"IF(ROW(DY3)-ROW(DY$2)+1>COUNT(DZ$2:DZ$13),\"\",INDEX(DY:DY,SMALL(DZ$2:DZ$13,1+ROW(DY3)-ROW(DY$2))))","v":"Unit 14 - Photography Briefs"},null,"Unit 8 - Using Mobile Devices in Art and Design",{"$f":"IF(COUNTIF(Diploma!list1,EC3)>=1,\"\",ROW())","v":3},{"$f":"IF(ROW(EC3)-ROW(EC$2)+1>COUNT(ED$2:ED$16),\"\",INDEX(EC:EC,SMALL(ED$2:ED$16,1+ROW(EC3)-ROW(EC$2))))","v":"Unit 8 - Using Mobile Devices in Art and Design"},null,null,null,null,null,{"$f":"IF(OR(AF15=1,AF12=1),\"\",\"Unit 10 - Marketing and Promotion in Hospitality\")","v":"Unit 10 - Marketing and Promotion in Hospitality"},3,{"$f":"IF(ROW(EK3)-ROW(EK$2)+1>COUNT(EL$2:EL$13),\"\",INDEX(EK:EK,SMALL(EL$2:EL$13,1+ROW(EK3)-ROW(EK$2))))","v":"Unit 10 - Marketing and Promotion in Hospitality"},null,"Unit 12 - The Development of Music",3,{"$f":"IF(ROW(EO3)-ROW(EO$2)+1>COUNT(EP$2:EP$16),\"\",INDEX(EO:EO,SMALL(EP$2:EP$16,1+ROW(EO3)-ROW(EO$2))))","v":"Unit 12 - The Development of Music"},null,"Unit 10 - World Energy",{"$f":"IF(COUNTIF('Extended Certificate'!$G$21:$G$29,ES3)>=1,\"\",ROW())","v":3},{"$f":"IF(ROW(ES3)-ROW(ES$2)+1>COUNT(ET$2:ET$17),\"\",INDEX(ES:ES,SMALL(ET$2:ET$17,1+ROW(ES3)-ROW(ES$2))))","v":"Unit 10 - World Energy"},null,"Unit 4 - Public Services and Community Protection",{"$f":"IF(COUNTIF('Extended Certificate'!$G$21:$G$29,EW3)>=1,\"\",ROW())","v":3},{"$f":"IF(ROW(EW3)-ROW(EW$2)+1>COUNT(EX$2:EX$15),\"\",INDEX(EW:EW,SMALL(EX$2:EX$15,1+ROW(EW3)-ROW(EW$2))))","v":"Unit 4 - Public Services and Community Protection"},null,"Unit 6 - Introducing Retail Business",3,{"$f":"IF(ROW(FA3)-ROW(FA$2)+1>COUNT(FB$2:FB$11),\"\",INDEX(FA:FA,SMALL(FB$2:FB$11,1+ROW(FA3)-ROW(FA$2))))","v":"Unit 6 - Introducing Retail Business"},null,{"$f":"IF(OR(P23=1,P26=1,P29=1,P32=1),\"\",\"Unit 6 - Exploring Carpentry and Joinery Principles and Techniques\")","v":"Unit 6 - Exploring Carpentry and Joinery Principles and Techniques"},3,{"$f":"IF(ROW(FE3)-ROW(FE$2)+1>COUNT(FF$2:FF$14),\"\",INDEX(FE:FE,SMALL(FF$2:FF$14,1+ROW(FE3)-ROW(FE$2))))","v":"Unit 6 - Exploring Carpentry and Joinery Principles and Techniques"},null,"Unit 10 - Digital Photography for a Media Product",{"$f":"IF(COUNTIF(list2,FI3)>=1,\"\",ROW())","v":3},{"$f":"IF(ROW(FI3)-ROW(FI$2)+1>COUNT(FJ$2:FJ$6),\"\",INDEX(FI:FI,SMALL(FJ$2:FJ$6,1+ROW(FI3)-ROW(FI$2))))","v":"Unit 10 - Digital Photography for a Media Product"},null,"Unit 13 - Graphic Design for Digital Media",3,{"$f":"IF(ROW(FM3)-ROW(FM$2)+1>COUNT(FN$2:FN$8),\"\",INDEX(FM:FM,SMALL(FN$2:FN$8,1+ROW(FM3)-ROW(FM$2))))","v":"Unit 13 - Graphic Design for Digital Media"},null,"Unit 6 - Computer-aided Engineering",3,{"$f":"IF(ROW(FQ3)-ROW(FQ$2)+1>COUNT(FR$2:FR$24),\"\",INDEX(FQ:FQ,SMALL(FR$2:FR$24,1+ROW(FQ3)-ROW(FQ$2))))","v":"Unit 6 - Computer-aided Engineering"},null,"Unit 5 - Promoting Health and Wellbeing",3,{"$f":"IF(ROW(FU3)-ROW(FU$2)+1>COUNT(FV$2:FV$9),\"\",INDEX(FU:FU,SMALL(FV$2:FV$9,1+ROW(FU3)-ROW(FU$2))))","v":"Unit 5 - Promoting Health and Wellbeing"},null,"Unit 5 - Creating Digital Audio",3,{"$f":"IF(ROW(FY3)-ROW(FY$2)+1>COUNT(FZ$2:FZ$9),\"\",INDEX(FY:FY,SMALL(FZ$2:FZ$9,1+ROW(FY3)-ROW(FY$2))))","v":"Unit 5 - Creating Digital Audio"},null,"Unit 5 - Creating Digital Audio",{"$f":"IF(COUNTIF(Diploma!list1,GC3)>=1,\"\",ROW())","v":3},{"$f":"IF(ROW(GC3)-ROW(GC$2)+1>COUNT(GD$2:GD$17),\"\",INDEX(GC:GC,SMALL(GD$2:GD$17,1+ROW(GC3)-ROW(GC$2))))","v":"Unit 5 - Creating Digital Audio"},null,"Unit 5 - Creating Digital Audio",{"$f":"IF(COUNTIF(Diploma!list1,GG3)>=1,\"\",ROW())","v":3},{"$f":"IF(ROW(GG3)-ROW(GG$2)+1>COUNT(GH$2:GH$17),\"\",INDEX(GG:GG,SMALL(GH$2:GH$17,1+ROW(GG3)-ROW(GG$2))))","v":"Unit 5 - Creating Digital Audio"},null,"Unit 13 - Volunteering for the Public Services",{"$f":"IF(COUNTIF(Diploma!list1,GK3)>=1,\"\",ROW())","v":3},{"$f":"IF(ROW(GK3)-ROW(GK$2)+1>COUNT(GL$2:GL$7),\"\",INDEX(GK:GK,SMALL(GL$2:GL$7,1+ROW(GK3)-ROW(GK$2))))","v":"Unit 13 - Volunteering for the Public Services"},null,"Unit 4 - Public Services and Community Protection",3,{"$f":"IF(ROW(GO3)-ROW(GO$2)+1>COUNT(GP$2:GP$9),\"\",INDEX(GO:GO,SMALL(GP$2:GP$9,1+ROW(GO3)-ROW(GO$2))))","v":"Unit 4 - Public Services and Community Protection"},null,"Unit 8 - Promotion and Sponsorship in Sport",3,{"$f":"IF(ROW(GS3)-ROW(GS$2)+1>COUNT(GT$2:GT$10),\"\",INDEX(GS:GS,SMALL(GT$2:GT$10,1+ROW(GS3)-ROW(GS$2))))","v":"Unit 8 - Promotion and Sponsorship in Sport"},null,"Unit 19 - Practical Land-based Outdoor and Adventurous Activities",{"$f":"IF(COUNTIF(Diploma!list1,GW3)>=1,\"\",ROW())","v":3},{"$f":"IF(ROW(GW3)-ROW(GW$2)+1>COUNT(GX$2:GX$6),\"\",INDEX(GW:GW,SMALL(GX$2:GX$6,1+ROW(GW3)-ROW(GW$2))))","v":"Unit 19 - Practical Land-based Outdoor and Adventurous Activities"},null,"Unit 8 - Promotion and Sponsorship in Sport",3,{"$f":"IF(ROW(HA3)-ROW(HA$2)+1>COUNT(HB$2:HB$13),\"\",INDEX(HA:HA,SMALL(HB$2:HB$13,1+ROW(HA3)-ROW(HA$2))))","v":"Unit 8 - Promotion and Sponsorship in Sport"},null,"Unit 24 - Work Experience in Sport",{"$f":"IF(COUNTIF(Diploma!list1,HE3)>=1,\"\",ROW())","v":3},{"$f":"IF(ROW(HE3)-ROW(HE$2)+1>COUNT(HF$2:HF$3),\"\",INDEX(HE:HE,SMALL(HF$2:HF$3,1+ROW(HE3)-ROW(HE$2))))","v":"Unit 24 - Work Experience in Sport"},null,"Unit 8 - Promotion and Sponsorship in Sport",3,{"$f":"IF(ROW(HI3)-ROW(HI$2)+1>COUNT(HJ$2:HJ$8),\"\",INDEX(HI:HI,SMALL(HJ$2:HJ$8,1+ROW(HI3)-ROW(HI$2))))","v":"Unit 8 - Promotion and Sponsorship in Sport"},null,"Unit 9 - Travel and Tourism Employment Opportunities",3,{"$f":"IF(ROW(HM3)-ROW(HM$2)+1>COUNT(HN$2:HN$10),\"\",INDEX(HM:HM,SMALL(HN$2:HN$10,1+ROW(HM3)-ROW(HM$2))))","v":"Unit 9 - Travel and Tourism Employment Opportunities"},null,"Unit 34 - PC Software and Hardware in Engineering",{"$f":"IF(COUNTIF(Diploma!list1,HQ3)>=1,\"\",ROW())","v":3},{"$f":"IF(ROW(HQ3)-ROW(HQ$2)+1>COUNT(HR$2:HR$10),\"\",INDEX(HQ:HQ,SMALL(HR$2:HR$10,1+ROW(HQ3)-ROW(HQ$2))))","v":"Unit 34 - PC Software and Hardware in Engineering"},null,"Unit 6 - Computer-aided Engineering",3,{"$f":"IF(ROW(HU3)-ROW(HU$2)+1>COUNT(HV$2:HV$8),\"\",INDEX(HU:HU,SMALL(HV$2:HV$8,1+ROW(HU3)-ROW(HU$2))))","v":"Unit 6 - Computer-aided Engineering"},null,"Unit 25 - Operation and Maintenance of Electronic Systems and Components",{"$f":"IF(COUNTIF(Diploma!list1,HY3)>=1,\"\",ROW())","v":3},{"$f":"IF(ROW(HY3)-ROW(HY$2)+1>COUNT(HZ$2:HZ$5),\"\",INDEX(HY:HY,SMALL(HZ$2:HZ$5,1+ROW(HY3)-ROW(HY$2))))","v":"Unit 25 - Operation and Maintenance of Electronic Systems and Components"},null,"Unit 11 - Electrical and Mechanical Science for Engineering",3,{"$f":"IF(ROW(IC3)-ROW(IC$2)+1>COUNT(ID$2:ID$8),\"\",INDEX(IC:IC,SMALL(ID$2:ID$8,1+ROW(IC3)-ROW(IC$2))))","v":"Unit 11 - Electrical and Mechanical Science for Engineering"},null,"Unit 22 - Continuous Improvement and Problem-Solving",{"$f":"IF(COUNTIF(Diploma!list1,IG3)>=1,\"\",ROW())","v":3},{"$f":"IF(ROW(IG3)-ROW(IG$2)+1>COUNT(IH$2:IH$4),\"\",INDEX(IG:IG,SMALL(IH$2:IH$4,1+ROW(IG3)-ROW(IG$2))))","v":"Unit 22 - Continuous Improvement and Problem-Solving"},null,"Unit 6 - Computer-aided Engineering",3,{"$f":"IF(ROW(IK3)-ROW(IK$2)+1>COUNT(IL$2:IL$13),\"\",INDEX(IK:IK,SMALL(IL$2:IL$13,1+ROW(IK3)-ROW(IK$2))))","v":"Unit 6 - Computer-aided Engineering"},null,"Unit 28 - Fabrication Techniques",{"$f":"IF(COUNTIF(Diploma!list1,IO3)>=1,\"\",ROW())","v":3},{"$f":"IF(ROW(IO3)-ROW(IO$2)+1>COUNT(IP$2:IP$4),\"\",INDEX(IO:IO,SMALL(IP$2:IP$4,1+ROW(IO3)-ROW(IO$2))))","v":"Unit 28 - Fabrication Techniques"},null,"Unit 6 - Computer-aided Engineering",3,{"$f":"IF(ROW(IS3)-ROW(IS$2)+1>COUNT(IT$2:IT$12),\"\",INDEX(IS:IS,SMALL(IT$2:IT$12,1+ROW(IS3)-ROW(IS$2))))","v":"Unit 6 - Computer-aided Engineering"}]
["Unit 8 - Using Mobile Devices in Art and Design",{"$f":"IF(COUNTIF(Diploma!list1,A4)>=1,\"\",ROW())","v":4},"Unit 8 - Using Mobile Devices in Art and Design",null,"Unit 21 - Effective Business Communication",{"$f":"IF(COUNTIF(Diploma!list1,E4)>=1,\"\",ROW())","v":4},"Unit 21 - Effective Business Communication",null,"Unit 7 - Making Healthy Food Choices for Children",{"$f":"IF(COUNTIF(Certificate!$G$17:$G$21,I4)>=1,\"\",ROW())","v":4},{"$f":"IF(ROW(I4)-ROW(I$2)+1>COUNT(J$2:J$5),\"\",INDEX(I:I,SMALL(J$2:J$5,1+ROW(I4)-ROW(I$2))))","v":"Unit 7 - Making Healthy Food Choices for Children"},null,{"$f":"IF(OR(P20=1,P23=1,P29=1,P32=1),\"\",\"Unit 18 - Painting and Paperhanging Operations\")","v":"Unit 18 - Painting and Paperhanging Operations"},{"$f":"IF(COUNTIF(Diploma!list1,M4)>=1,\"\",ROW())","v":4},"Unit 18 - Painting and Paperhanging Operations",null,"Unit 5 - Digital Publishing Production",{"$f":"IF(COUNTIF(Diploma!list1,Q4)>=1,\"\",ROW())","v":4},"Unit 5 - Digital Publishing Production",null,"Unit 12 - Engineering Design",{"$f":"IF(COUNTIF(Diploma!list1,U4)>=1,\"\",ROW())","v":4},"Unit 12 - Engineering Design",null,{"$f":"IF(Y16=1,\"\",\"Unit 16 - Vocational Experience in Health and Social Care\")","v":"Unit 16 - Vocational Experience in Health and Social Care"},{"$f":"IF(COUNTIF(Diploma!list1,Y4)>=1,\"\",ROW())","v":4},"Unit 16 - Vocational Experience in Health and Social Care",null,{"$f":"IF(OR(AF15=1,AF12=1),\"\",\"Unit 7 - Food and Beverage Service in the Hospitality Industry\")","v":"Unit 7 - Food and Beverage Service in the Hospitality Industry"},{"$f":"IF(COUNTIF(Diploma!list1,AC4)>=1,\"\",ROW())","v":4},"Unit 7 - Food and Beverage Service in the Hospitality Industry",null,null,null,null,null,"Unit 12 - Software Development",{"$f":"IF(COUNTIF(Diploma!list1,AK4)>=1,\"\",ROW())","v":4},"Unit 12 - Software Development",null,"Unit 5 - Introducing Music Performance",{"$f":"IF(COUNTIF(Diploma!list1,AO4)>=1,\"\",ROW())","v":4},"Unit 5 - Introducing Music Performance",null,"Unit 5 - Musical Theatre Skills",{"$f":"IF(COUNTIF(Diploma!list1,AS4)>=1,\"\",ROW())","v":4},"Unit 5 - Musical Theatre Skills",null,"Unit 12 - Exploring Improvisation",4,"Unit 12 - Exploring Improvisation",null,"Unit 11 - Devising Performance Work",{"$f":"IF(COUNTIF(Certificate!$G$23:$G$25,BA4)>=1,\"\",ROW())","v":4},"Unit 11 - Devising Performance Work",null,"Unit 13 - Multimedia Performance",{"$f":"IF(COUNTIF(Diploma!list1,BE4)>=1,\"\",ROW())","v":4},"Unit 13 - Multimedia Performance",null,"Unit 18 - Jazz Dance Techniques",4,"Unit 18 - Jazz Dance Techniques",null,"Unit 21 - Realising Set Design for Performance",{"$f":"IF(COUNTIF('Extended Certificate'!$G$39,BM4)>=1,\"\",ROW())","v":4},"Unit 21 - Realising Set Design for Performance",null,null,null,null,null,"Unit 12 - Exploring Improvisation",{"$f":"IF(COUNTIF(Diploma!list1,BU4)>=1,\"\",ROW())","v":4},"Unit 12 - Exploring Improvisation",null,"Unit 20 - Realising Costume Design for Performance",4,"Unit 20 - Realising Costume Design for Performance",null,"Unit 21 - Realising Set Design for Performance",{"$f":"IF(COUNTIF('Extended Certificate'!$G$39,CC4)>=1,\"\",ROW())","v":4},"Unit 21 - Realising Set Design for Performance",null,"Unit 11 - Devising Performance Work",{"$f":"IF(COUNTIF('Extended Certificate'!$G$21:$G$29,CG4)>=1,\"\",ROW())","v":4},{"$f":"IF(ROW(CG4)-ROW(CG$2)+1>COUNT(CH$2:CH$6),\"\",INDEX(BE:BE,SMALL(CH$2:CH$6,1+ROW(CG4)-ROW(CG$2))))","v":"Unit 13 - Multimedia Performance"},null,"Unit 17 - Exploring Urban Dance Styles",{"$f":"IF(COUNTIF(Certificate!$G$23:$G$25,CK4)>=1,\"\",ROW())","v":4},"Unit 17 - Exploring Urban Dance Styles",null,"Unit 21 - Realising Set Design for Performance",{"$f":"IF(COUNTIF(Diploma!list1,CO4)>=1,\"\",ROW())","v":4},"Unit 21 - Realising Set Design for Performance",null,"Unit 14 - Voice and Speech for Performers",{"$f":"IF(COUNTIF(list2,CS4)>=1,\"\",ROW())","v":4},"Unit 14 - Voice and Speech for Performers",null,"Unit 18 - Expedition Experience",{"$f":"IF(COUNTIF(Diploma!list1,CW4)>=1,\"\",ROW())","v":4},"Unit 18 - Expedition Experience",null,"Unit 14 - Travel and Tourism Research Project",{"$f":"IF(COUNTIF(Diploma!list1,DA4)>=1,\"\",ROW())","v":4},"Unit 14 - Travel and Tourism Research Project",null,"Unit 11 - Animation for Digital Media",{"$f":"IF(COUNTIF('Extended Certificate'!$G$31:$G$37,DE4)>=1,\"\",ROW())","v":4},"Unit 11 - Animation for Digital Media",null,"Unit 18 - 3D Design Briefs",{"$f":"IF(COUNTIF(Diploma!list1,DI4)>=1,\"\",ROW())","v":4},"Unit 18 - 3D Design Briefs",null,"Unit 14 - Photography Briefs",{"$f":"IF(COUNTIF(Diploma!list1,DM4)>=1,\"\",ROW())","v":4},"Unit 14 - Photography Briefs",null,"Unit 8 - Using Mobile Devices in Art and Design",{"$f":"IF(COUNTIF(Diploma!list1,DQ4)>=1,\"\",ROW())","v":4},"Unit 8 - Using Mobile Devices in Art and Design",null,"Unit 8 - Using Mobile Devices in Art and Design",{"$f":"IF(COUNTIF(Diploma!list1,DU4)>=1,\"\",ROW())","v":4},"Unit 8 - Using Mobile Devices in Art and Design",null,"Unit 17 - Art, Craft and Design in the Creative Industries",{"$f":"IF(COUNTIF(Diploma!list1,DY4)>=1,\"\",ROW())","v":4},"Unit 17 - Art, Craft and Design in the Creative Industries",null,"Unit 10 - Fashion Briefs",{"$f":"IF(COUNTIF(Diploma!list1,EC4)>=1,\"\",ROW())","v":4},"Unit 10 - Fashion Briefs",null,null,null,null,null,{"$f":"IF(OR(AF15=1,AF12=1),\"\",\"Unit 12 - Planning and Running a Hospitality Event\")","v":"Unit 12 - Planning and Running a Hospitality Event"},4,"Unit 12 - Planning and Running a Hospitality Event",null,"Unit 13 - Developing Music Composition",4,"Unit 13 - Developing Music Composition",null,"Unit 11 - How Scientific Theories are Formulated ",{"$f":"IF(COUNTIF('Extended Certificate'!$G$21:$G$29,ES4)>=1,\"\",ROW())","v":4},"Unit 11 - How Scientific Theories are Formulated ",null,"Unit 5 - Health, Fitness and Lifestyle for the Public Services",{"$f":"IF(COUNTIF('Extended Certificate'!$G$21:$G$29,EW4)>=1,\"\",ROW())","v":4},"Unit 5 - Health, Fitness and Lifestyle for the Public Services",null,"Unit 7 - Providing Business Support",4,"Unit 7 - Providing Business Support",null,{"$f":"IF(OR(P20=1,P26=1,P29=1,P32=1),\"\",\"Unit 7 - Exploring Brickwork and Blockwork Principles and Techniques\")","v":"Unit 7 - Exploring Brickwork and Blockwork Principles and Techniques"},4,"Unit 7 - Exploring Brickwork and Blockwork Principles and Techniques",null,"Unit 11 - Animation for Digital Media",{"$f":"IF(COUNTIF(list2,FI4)>=1,\"\",ROW())","v":4},"Unit 11 - Animation for Digital Media",null,"Unit 14 - Writing for Digital Media",4,"Unit 14 - Writing for Digital Media",null,"Unit 11 - Electrical and Mechanical Science for Engineering",4,"Unit 11 - Electrical and Mechanical Science for Engineering",null,"Unit 6 - The Impact of Nutrition on Health and Wellbeing",4,"Unit 6 - The Impact of Nutrition on Health and Wellbeing",null,"Unit 6 - Creating Digital Graphics",4,"Unit 6 - Creating Digital Graphics",null,"Unit 6 - Creating Digital Graphics",{"$f":"IF(COUNTIF(Diploma!list1,GC4)>=1,\"\",ROW())","v":4},"Unit 6 - Creating Digital Graphics",null,"Unit 6 - Creating Digital Graphics",{"$f":"IF(COUNTIF(Diploma!list1,GG4)>=1,\"\",ROW())","v":4},"Unit 6 - Creating Digital Graphics",null,{"$f":"IF(GK20=1,\"\",\"Unit 14 - Multi-day Expedition Experience\")","v":"Unit 14 - Multi-day Expedition Experience"},{"$f":"IF(COUNTIF(Diploma!list1,GK4)>=1,\"\",ROW())","v":4},"Unit 14 - Multi-day Expedition Experience",null,"Unit 5 - Health, Fitness and Lifestyle for the Public Services",4,"Unit 5 - Health, Fitness and Lifestyle for the Public Services",null,"Unit 9 - Lifestyle and Well-being",4,"Unit 9 - Lifestyle and Well-being",null,"Unit 20 - Practical Water-based Outdoor and Adventurous Activities",{"$f":"IF(COUNTIF(Diploma!list1,GW4)>=1,\"\",ROW())","v":4},"Unit 20 - Practical Water-based Outdoor and Adventurous Activities",null,"Unit 9 - Lifestyle and Well-being",4,"Unit 9 - Lifestyle and Well-being",null,null,null,null,null,"Unit 11 - Running a Sports Event",4,"Unit 11 - Running a Sports Event",null,"Unit 10 - Organising a Travel and Tourism Study Visit",4,"Unit 10 - Organising a Travel and Tourism Study Visit",null,null,null,null,null,"Unit 8 - Electronic Circuit Design and Construction",4,"Unit 8 - Electronic Circuit Design and Construction",null,"Unit 26 - Operation and Maintenance of Electrical Systems and Components",{"$f":"IF(COUNTIF(Diploma!list1,HY4)>=1,\"\",ROW())","v":4},"Unit 26 - Operation and Maintenance of Electrical Systems and Components",null,"Unit 13 - Engineering Assembly",4,"Unit 13 - Engineering Assembly",null,"Unit 23 - Electronic Devices and Communication Applications",{"$f":"IF(COUNTIF(Diploma!list1,IG4)>=1,\"\",ROW())","v":4},"Unit 23 - Electronic Devices and Communication Applications",null,"Unit 7 - Machining Techniques",4,"Unit 7 - Machining Techniques",null,"Unit 29 - Casting Techniques",{"$f":"IF(COUNTIF(Diploma!list1,IO4)>=1,\"\",ROW())","v":4},"Unit 29 - Casting Techniques",null,"Unit 11 - Electrical and Mechanical Science for Engineering",4,"Unit 11 - Electrical and Mechanical Science for Engineering"]
[{"$f":"IF(A48=1,\"\",\"Unit 9 - Design Crafts Briefs\")","v":"Unit 9 - Design Crafts Briefs"},{"$f":"IF(COUNTIF(Diploma!list1,A5)>=1,\"\",ROW())","v":5},"Unit 9 - Design Crafts Briefs",null,"Unit 22 - Working in Business Teams",{"$f":"IF(COUNTIF(Diploma!list1,E5)>=1,\"\",ROW())","v":5},"Unit 22 - Working in Business Teams",null,"Unit 8 - Introduction to Working in the Early Years Sector",{"$f":"IF(COUNTIF(Certificate!$G$17:$G$21,I5)>=1,\"\",ROW())","v":5},{"$f":"IF(ROW(I5)-ROW(I$2)+1>COUNT(J$2:J$5),\"\",INDEX(I:I,SMALL(J$2:J$5,1+ROW(I5)-ROW(I$2))))","v":"Unit 8 - Introduction to Working in the Early Years Sector"},null,{"$f":"IF(OR(P20=1,P23=1,P26=1,P29=1,P32=1),\"\",\"Unit 22 - Tendering and Estimating\")","v":"Unit 22 - Tendering and Estimating"},{"$f":"IF(COUNTIF(Diploma!list1,M5)>=1,\"\",ROW())","v":5},"Unit 22 - Tendering and Estimating",null,"Unit 6 - Website Production",{"$f":"IF(COUNTIF(Diploma!list1,Q5)>=1,\"\",ROW())","v":5},"Unit 6 - Website Production",null,"Unit 15 - Operating an Efficient Workplace",{"$f":"IF(COUNTIF(Diploma!list1,U5)>=1,\"\",ROW())","v":5},"Unit 15 - Operating an Efficient Workplace",null,{"$f":"IF(Y13=1,\"\",\"Unit 17 - Community Volunteering in Health and Social Care\")","v":"Unit 17 - Community Volunteering in Health and Social Care"},{"$f":"IF(COUNTIF(Diploma!list1,Y5)>=1,\"\",ROW())","v":5},"Unit 17 - Community Volunteering in Health and Social Care",null,{"$f":"IF(OR(AF15=1,AF12=1),\"\",\"Unit 8 - Front Office Services in the Hospitality Industry\")","v":"Unit 8 - Front Office Services in the Hospitality Industry"},{"$f":"IF(COUNTIF(Diploma!list1,AC5)>=1,\"\",ROW())","v":5},"Unit 8 - Front Office Services in the Hospitality Industry",null,null,null,null,null,"Unit 13 - Website Development",{"$f":"IF(COUNTIF(Diploma!list1,AK5)>=1,\"\",ROW())","v":5},"Unit 13 - Website Development",null,"Unit 6 - Introducing Music Recording",{"$f":"IF(COUNTIF(Diploma!list1,AO5)>=1,\"\",ROW())","v":5},"Unit 6 - Introducing Music Recording",null,"Unit 6 - Music Performance Skills",{"$f":"IF(COUNTIF(Diploma!list1,AS5)>=1,\"\",ROW())","v":5},"Unit 6 - Music Performance Skills",null,"Unit 13 - Multimedia Performance",5,"Unit 13 - Multimedia Performance",null,"Unit 12 - Exploring Improvisation",{"$f":"IF(COUNTIF(Certificate!$G$23:$G$25,BA5)>=1,\"\",ROW())","v":5},"Unit 12 - Exploring Improvisation",null,"Unit 14 - Voice and Speech for Performers",{"$f":"IF(COUNTIF(Diploma!list1,BE5)>=1,\"\",ROW())","v":5},"Unit 14 - Voice and Speech for Performers",null,"Unit 20 - Realising Costume Design for Performance",5,"Unit 20 - Realising Costume Design for Performance",null,"Unit 22 - Realising Prop Design for Performance",{"$f":"IF(COUNTIF('Extended Certificate'!$G$39,BM5)>=1,\"\",ROW())","v":5},"Unit 22 - Realising Prop Design for Performance",null,null,null,null,null,"Unit 13 - Multimedia Performance",{"$f":"IF(COUNTIF(Diploma!list1,BU5)>=1,\"\",ROW())","v":5},"Unit 13 - Multimedia Performance",null,"Unit 21 - Realising Set Design for Performance",5,"Unit 21 - Realising Set Design for Performance",null,"Unit 22 - Realising Prop Design for Performance",{"$f":"IF(COUNTIF('Extended Certificate'!$G$39,CC5)>=1,\"\",ROW())","v":5},"Unit 22 - Realising Prop Design for Performance",null,"Unit 14 - Voice and Speech for Performers",{"$f":"IF(COUNTIF('Extended Certificate'!$G$21:$G$29,CG5)>=1,\"\",ROW())","v":5},{"$f":"IF(ROW(CG5)-ROW(CG$2)+1>COUNT(CH$2:CH$6),\"\",INDEX(BE:BE,SMALL(CH$2:CH$6,1+ROW(CG5)-ROW(CG$2))))","v":"Unit 14 - Voice and Speech for Performers"},null,"Unit 18 - Jazz Dance Techniques",{"$f":"IF(COUNTIF(Certificate!$G$23:$G$25,CK5)>=1,\"\",ROW())","v":5},"Unit 18 - Jazz Dance Techniques",null,"Unit 22 - Realising Prop Design for Performance",{"$f":"IF(COUNTIF(Diploma!list1,CO5)>=1,\"\",ROW())","v":5},"Unit 22 - Realising Prop Design for Performance",null,"Unit 15 - Performing Scripted Plays",{"$f":"IF(COUNTIF(list2,CS5)>=1,\"\",ROW())","v":5},"Unit 15 - Performing Scripted Plays",null,"Unit 19 - Practical Land-based Outdoor and Adventurous Activities",{"$f":"IF(COUNTIF(Diploma!list1,CW5)>=1,\"\",ROW())","v":5},"Unit 19 - Practical Land-based Outdoor and Adventurous Activities",null,"Unit 15 - Work-related Experience in Travel and Tourism",{"$f":"IF(COUNTIF(Diploma!list1,DA5)>=1,\"\",ROW())","v":5},"Unit 15 - Work-related Experience in Travel and Tourism",null,"Unit 12 - Digital Audio Editing",{"$f":"IF(COUNTIF('Extended Certificate'!$G$31:$G$37,DE5)>=1,\"\",ROW())","v":5},"Unit 12 - Digital Audio Editing",null,"Unit 22 - Designing Products",{"$f":"IF(COUNTIF(Diploma!list1,DI5)>=1,\"\",ROW())","v":5},"Unit 22 - Designing Products",null,"Unit 15 - Designing for the Future",{"$f":"IF(COUNTIF(Diploma!list1,DM5)>=1,\"\",ROW())","v":5},"Unit 15 - Designing for the Future",null,"Unit 17 - Art, Craft and Design in the Creative Industries",{"$f":"IF(COUNTIF(Diploma!list1,DQ5)>=1,\"\",ROW())","v":5},"Unit 17 - Art, Craft and Design in the Creative Industries",null,"Unit 10 - Fashion Briefs",{"$f":"IF(COUNTIF(Diploma!list1,DU5)>=1,\"\",ROW())","v":5},"Unit 10 - Fashion Briefs",null,"Unit 19 - Digital Art and Design Briefs",{"$f":"IF(COUNTIF(Diploma!list1,DY5)>=1,\"\",ROW())","v":5},"Unit 19 - Digital Art and Design Briefs",null,"Unit 14 - Photography Briefs",{"$f":"IF(COUNTIF(Diploma!list1,EC5)>=1,\"\",ROW())","v":5},"Unit 14 - Photography Briefs",null,null,null,null,null,{"$f":"IF(OR(AF15=1,AF12=1),\"\",\"Unit 13 - Contemporary World Food Cooking Skills\")","v":"Unit 13 - Contemporary World Food Cooking Skills"},5,"Unit 13 - Contemporary World Food Cooking Skills",null,"Unit 14 - Producing a Music Recording",5,"Unit 14 - Producing a Music Recording",null,"Unit 12 - The Living Body",{"$f":"IF(COUNTIF('Extended Certificate'!$G$21:$G$29,ES5)>=1,\"\",ROW())","v":5},"Unit 12 - The Living Body",null,"Unit 8 - Promotion of Public Service Provision",{"$f":"IF(COUNTIF('Extended Certificate'!$G$21:$G$29,EW5)>=1,\"\",ROW())","v":5},"Unit 8 - Promotion of Public Service Provision",null,{"$f":"IF(G22=1,\"\",\"Unit 8 - Recruitment, Selection and Employment\")","v":"Unit 8 - Recruitment, Selection and Employment"},5,"Unit 8 - Recruitment, Selection and Employment",null,{"$f":"IF(OR(P20=1,P23=1,P29=1,P32=1),\"\",\"Unit 8 - Exploring Painting and Decorating Principles and Techniques\")","v":"Unit 8 - Exploring Painting and Decorating Principles and Techniques"},5,"Unit 8 - Exploring Painting and Decorating Principles and Techniques",null,"Unit 19 - Advertising Production",{"$f":"IF(COUNTIF(list2,FI5)>=1,\"\",ROW())","v":5},"Unit 19 - Advertising Production",null,"Unit 15 - Digital Games Testing",5,"Unit 15 - Digital Games Testing",null,"Unit 13 - Engineering Assembly",5,"Unit 13 - Engineering Assembly",null,"Unit 11 - Services in Health and Social Care",5,"Unit 11 - Services in Health and Social Care",null,"Unit 7 - Creating Digital Video",5,"Unit 7 - Creating Digital Video",null,"Unit 7 - Creating Digital Video",{"$f":"IF(COUNTIF(Diploma!list1,GC5)>=1,\"\",ROW())","v":5},"Unit 7 - Creating Digital Video",null,"Unit 7 - Creating Digital Video",{"$f":"IF(COUNTIF(Diploma!list1,GG5)>=1,\"\",ROW())","v":5},"Unit 7 - Creating Digital Video",null,"Unit 17 - Preparing to Respond to Emergency Incidents",{"$f":"IF(COUNTIF(Diploma!list1,GK5)>=1,\"\",ROW())","v":5},"Unit 17 - Preparing to Respond to Emergency Incidents",null,"Unit 8 - Promotion of Public Service Provision",5,"Unit 8 - Promotion of Public Service Provision",null,"Unit 10 - Injury and the Sports Performer",5,"Unit 10 - Injury and the Sports Performer",null,"Unit 21 - Land-based Outdoor and Adventurous Activity Leadership",{"$f":"IF(COUNTIF(Diploma!list1,GW5)>=1,\"\",ROW())","v":5},"Unit 21 - Land-based Outdoor and Adventurous Activity Leadership",null,"Unit 10 - Injury and the Sports Performer",5,"Unit 10 - Injury and the Sports Performer",null,null,null,null,null,"Unit 12 - The Sport and Active Leisure Industry",5,"Unit 12 - The Sport and Active Leisure Industry",null,"Unit 16 - Holiday Representatives",5,"Unit 16 - Holiday Representatives",null,null,null,null,null,"Unit 11 - Electrical and Mechanical Science for Engineering",5,"Unit 11 - Electrical and Mechanical Science for Engineering",null,"Unit 27 - Operation and Maintenance of Fluid Power Systems and Components",{"$f":"IF(COUNTIF(Diploma!list1,HY5)>=1,\"\",ROW())","v":5},"Unit 27 - Operation and Maintenance of Fluid Power Systems and Components",null,"Unit 14 - Vehicle Engines and Other Systems",5,"Unit 14 - Vehicle Engines and Other Systems",null,null,null,null,null,"Unit 11 - Electrical and Mechanical Science for Engineering",5,"Unit 11 - Electrical and Mechanical Science for Engineering",null,null,null,null,null,"Unit 12 - Engineering Design",5,"Unit 12 - Engineering Design"]
["Unit 10 - Fashion Briefs",{"$f":"IF(COUNTIF(Diploma!list1,A6)>=1,\"\",ROW())","v":6},"Unit 10 - Fashion Briefs",null,"Unit 23 - Planning, Forecasting and Recording Business Finances",{"$f":"IF(COUNTIF(Diploma!list1,E6)>=1,\"\",ROW())","v":6},"Unit 23 - Planning, Forecasting and Recording Business Finances",null,null,null,null,null,{"$f":"IF(OR(P20=1,P23=1,P26=1,P29=1,P32=1),\"\",\"Unit 23 - Exploring Surveying\")","v":"Unit 23 - Exploring Surveying"},{"$f":"IF(COUNTIF(Diploma!list1,M6)>=1,\"\",ROW())","v":6},"Unit 23 - Exploring Surveying",null,"Unit 7 - Digital Games Production",{"$f":"IF(COUNTIF(Diploma!list1,Q6)>=1,\"\",ROW())","v":6},"Unit 7 - Digital Games Production",null,"Unit 18 - Computer Numerical Control Programming",{"$f":"IF(COUNTIF(Diploma!list1,U6)>=1,\"\",ROW())","v":6},"Unit 18 - Computer Numerical Control Programming",null,"Unit 18 - Child Development and Observation",{"$f":"IF(COUNTIF(Diploma!list1,Y6)>=1,\"\",ROW())","v":6},"Unit 18 - Child Development and Observation",null,{"$f":"IF(OR(AF15=1,AF12=1),\"\",\"Unit 11 - Accommodation Services in the Hospitality Industry\")","v":"Unit 11 - Accommodation Services in the Hospitality Industry"},{"$f":"IF(COUNTIF(Diploma!list1,AC6)>=1,\"\",ROW())","v":6},"Unit 11 - Accommodation Services in the Hospitality Industry",null,null,null,null,null,"Unit 14 - Installing and Maintaining Computer Hardware",{"$f":"IF(COUNTIF(Diploma!list1,AK6)>=1,\"\",ROW())","v":6},"Unit 14 - Installing and Maintaining Computer Hardware",null,"Unit 7 - Introducing Music Sequencing",{"$f":"IF(COUNTIF(Diploma!list1,AO6)>=1,\"\",ROW())","v":6},"Unit 7 - Introducing Music Sequencing",null,"Unit 7 - Production Skills for Performance",{"$f":"IF(COUNTIF(Diploma!list1,AS6)>=1,\"\",ROW())","v":6},"Unit 7 - Production Skills for Performance",null,"Unit 14 - Voice and Speech for Performers",6,"Unit 14 - Voice and Speech for Performers",null,"Unit 13 - Multimedia Performance",{"$f":"IF(COUNTIF(Certificate!$G$23:$G$25,BA6)>=1,\"\",ROW())","v":6},"Unit 13 - Multimedia Performance",null,"Unit 15 - Performing Scripted Plays",{"$f":"IF(COUNTIF(Diploma!list1,BE6)>=1,\"\",ROW())","v":6},"Unit 15 - Performing Scripted Plays",null,"Unit 21 - Realising Set Design for Performance",6,"Unit 21 - Realising Set Design for Performance",null,"Unit 23 - Realising Mask Design for Performance",{"$f":"IF(COUNTIF('Extended Certificate'!$G$39,BM6)>=1,\"\",ROW())","v":6},"Unit 23 - Realising Mask Design for Performance",null,null,null,null,null,"Unit 16 - Contemporary Dance Techniques",{"$f":"IF(COUNTIF(Diploma!list1,BU6)>=1,\"\",ROW())","v":6},"Unit 16 - Contemporary Dance Techniques",null,"Unit 28 - Make-up for Performance",6,"Unit 28 - Make-up for Performance",null,"Unit 23 - Realising Mask Design for Performance",{"$f":"IF(COUNTIF('Extended Certificate'!$G$39,CC6)>=1,\"\",ROW())","v":6},"Unit 23 - Realising Mask Design for Performance",null,null,null,null,null,"Unit 19 - Design Planning for Performance",{"$f":"IF(COUNTIF(Certificate!$G$23:$G$25,CK6)>=1,\"\",ROW())","v":6},"Unit 19 - Design Planning for Performance",null,"Unit 23 - Realising Mask Design for Performance",{"$f":"IF(COUNTIF(Diploma!list1,CO6)>=1,\"\",ROW())","v":6},"Unit 23 - Realising Mask Design for Performance",null,null,null,null,null,"Unit 20 - Practical Water-based Outdoor and Adventurous Activities",{"$f":"IF(COUNTIF(Diploma!list1,CW6)>=1,\"\",ROW())","v":6},"Unit 20 - Practical Water-based Outdoor and Adventurous Activities",null,null,null,null,null,"Unit 13 - Graphic Design for Digital Media",{"$f":"IF(COUNTIF('Extended Certificate'!$G$31:$G$37,DE6)>=1,\"\",ROW())","v":6},"Unit 13 - Graphic Design for Digital Media",null,"Unit 28 - Printmaking Briefs",{"$f":"IF(COUNTIF(Diploma!list1,DI6)>=1,\"\",ROW())","v":6},"Unit 28 - Printmaking Briefs",null,"Unit 17 - Art, Craft and Design in the Creative Industries",{"$f":"IF(COUNTIF(Diploma!list1,DM6)>=1,\"\",ROW())","v":6},"Unit 17 - Art, Craft and Design in the Creative Industries",null,"Unit 19 - Digital Art and Design Briefs",{"$f":"IF(COUNTIF(Diploma!list1,DQ6)>=1,\"\",ROW())","v":6},"Unit 19 - Digital Art and Design Briefs",null,{"$f":"IF(DU21=1,\"\",\"Unit 11 - Graphic Design Briefs\")","v":"Unit 11 - Graphic Design Briefs"},{"$f":"IF(COUNTIF(Diploma!list1,DU6)>=1,\"\",ROW())","v":6},"Unit 11 - Graphic Design Briefs",null,"Unit 21 - Painting Briefs",{"$f":"IF(COUNTIF(Diploma!list1,DY6)>=1,\"\",ROW())","v":6},"Unit 21 - Painting Briefs",null,"Unit 15 - Designing for the Future",{"$f":"IF(COUNTIF(Diploma!list1,EC6)>=1,\"\",ROW())","v":6},"Unit 15 - Designing for the Future",null,null,null,null,null,{"$f":"IF(OR(AF15=1,AF12=1),\"\",\"Unit 15 - Menu Planning\")","v":"Unit 15 - Menu Planning"},6,"Unit 15 - Menu Planning",null,"Unit 15 - Music Ensemble",6,"Unit 15 - Music Ensemble",null,"Unit 13 - Monitoring the Environment ",{"$f":"IF(COUNTIF('Extended Certificate'!$G$21:$G$29,ES6)>=1,\"\",ROW())","v":6},"Unit 13 - Monitoring the Environment ",null,"Unit 9 - Community and Cultural Awareness",{"$f":"IF(COUNTIF('Extended Certificate'!$G$21:$G$29,EW6)>=1,\"\",ROW())","v":6},"Unit 9 - Community and Cultural Awareness",null,"Unit 12 - Introducing Law and Consumer Rights",6,"Unit 12 - Introducing Law and Consumer Rights",null,{"$f":"IF(OR(P20=1,P23=1,P26=1,P32=1),\"\",\"Unit 9 - Exploring Plumbing Principles and Techniques\")","v":"Unit 9 - Exploring Plumbing Principles and Techniques"},6,"Unit 9 - Exploring Plumbing Principles and Techniques",null,"Unit 20 - Factual Media Production",{"$f":"IF(COUNTIF(list2,FI6)>=1,\"\",ROW())","v":6},"Unit 20 - Factual Media Production",null,"Unit 16 - Digital Art for a Media Product",6,"Unit 16 - Digital Art for a Media Product",null,"Unit 14 - Vehicle Engines and Other Systems",6,"Unit 14 - Vehicle Engines and Other Systems",null,"Unit 22 - An Introduction to Basic First Aid",6,"Unit 22 - An Introduction to Basic First Aid",null,"Unit 8 - Mobile Apps Development",6,"Unit 8 - Mobile Apps Development",null,"Unit 8 - Mobile Apps Development",{"$f":"IF(COUNTIF(Diploma!list1,GC6)>=1,\"\",ROW())","v":6},"Unit 8 - Mobile Apps Development",null,"Unit 8 - Mobile Apps Development",{"$f":"IF(COUNTIF(Diploma!list1,GG6)>=1,\"\",ROW())","v":6},"Unit 8 - Mobile Apps Development",null,"Unit 18 - Security Procedures in the Public Services",{"$f":"IF(COUNTIF(Diploma!list1,GK6)>=1,\"\",ROW())","v":6},"Unit 18 - Security Procedures in the Public Services",null,"Unit 9 - Community and Cultural Awareness",6,"Unit 9 - Community and Cultural Awareness",null,"Unit 11 - Running a Sports Event",6,"Unit 11 - Running a Sports Event",null,"Unit 22 - Water-based Outdoor and Adventurous Activity Leadership",{"$f":"IF(COUNTIF(Diploma!list1,GW6)>=1,\"\",ROW())","v":6},"Unit 22 - Water-based Outdoor and Adventurous Activity Leadership",null,"Unit 11 - Running a Sports Event",6,"Unit 11 - Running a Sports Event",null,null,null,null,null,"Unit 13 - Profiling Sports Performance",6,"Unit 13 - Profiling Sports Performance",null,"Unit 17 - UK Travel Agency Operations",6,"Unit 17 - UK Travel Agency Operations",null,null,null,null,null,"Unit 12 - Engineering Design",6,"Unit 12 - Engineering Design",null,null,null,null,null,"Unit 19 - Bicycle Servicing and Maintenance",6,"Unit 19 - Bicycle Servicing and Maintenance",null,null,null,null,null,"Unit 12 - Engineering Design",6,"Unit 12 - Engineering Design",null,null,null,null,null,"Unit 13 - Engineering Assembly",6,"Unit 13 - Engineering Assembly"]
[{"$f":"IF(A39=1,\"\",\"Unit 11 - Graphic Design Briefs\")","v":"Unit 11 - Graphic Design Briefs"},{"$f":"IF(COUNTIF(Diploma!list1,A7)>=1,\"\",ROW())","v":7},"Unit 11 - Graphic Design Briefs",null,{"$f":"IF(G19=1,\"\",\"Unit 24 - Work Experience in Business\")","v":"Unit 24 - Work Experience in Business"},{"$f":"IF(COUNTIF(Diploma!list1,E7)>=1,\"\",ROW())","v":7},"Unit 24 - Work Experience in Business",null,null,null,null,null,{"$f":"IF(OR(P20=1,P23=1,P26=1,P29=1,P32=1),\"\",\"Unit 24 - Exploring Civil Engineering\")","v":"Unit 24 - Exploring Civil Engineering"},{"$f":"IF(COUNTIF(Diploma!list1,M7)>=1,\"\",ROW())","v":7},"Unit 24 - Exploring Civil Engineering",null,null,null,null,null,null,null,null,null,"Unit 19 - Skills and Qualities for Working in the Health and Social Care Sector",{"$f":"IF(COUNTIF(Diploma!list1,Y7)>=1,\"\",ROW())","v":7},"Unit 19 - Skills and Qualities for Working in the Health and Social Care Sector",null,null,null,null,null,null,null,null,null,"Unit 15 - Installing and Maintaining Computer Software",{"$f":"IF(COUNTIF(Diploma!list1,AK7)>=1,\"\",ROW())","v":7},"Unit 15 - Installing and Maintaining Computer Software",null,"Unit 9 - Introducing Choral Studies",{"$f":"IF(COUNTIF(Diploma!list1,AO7)>=1,\"\",ROW())","v":7},"Unit 9 - Introducing Choral Studies",null,null,null,"",null,"Unit 15 - Performing Scripted Plays",7,"Unit 15 - Performing Scripted Plays",null,"Unit 14 - Voice and Speech for Performers",{"$f":"IF(COUNTIF(Certificate!$G$23:$G$25,BA7)>=1,\"\",ROW())","v":7},"Unit 14 - Voice and Speech for Performers",null,"Unit 32 - Directing Performance",{"$f":"IF(COUNTIF(Diploma!list1,BE7)>=1,\"\",ROW())","v":7},"Unit 32 - Directing Performance",null,"Unit 23 - Realising Mask Design for Performance",7,"Unit 23 - Realising Mask Design for Performance",null,"Unit 24 - Lighting for Performance",{"$f":"IF(COUNTIF('Extended Certificate'!$G$39,BM7)>=1,\"\",ROW())","v":7},"Unit 24 - Lighting for Performance",null,null,null,null,null,"Unit 17 - Exploring Urban Dance Styles",{"$f":"IF(COUNTIF(Diploma!list1,BU7)>=1,\"\",ROW())","v":7},"Unit 17 - Exploring Urban Dance Styles",null,"Unit 38 - Use of ICT in the Performing Arts",7,"Unit 38 - Use of ICT in the Performing Arts",null,"Unit 24 - Lighting for Performance",{"$f":"IF(COUNTIF('Extended Certificate'!$G$39,CC7)>=1,\"\",ROW())","v":7},"Unit 24 - Lighting for Performance",null,null,null,null,null,"Unit 20 - Realising Costume Design for Performance",{"$f":"IF(COUNTIF(Certificate!$G$23:$G$25,CK7)>=1,\"\",ROW())","v":7},"Unit 20 - Realising Costume Design for Performance",null,"Unit 24 - Lighting for Performance",{"$f":"IF(COUNTIF(Diploma!list1,CO7)>=1,\"\",ROW())","v":7},"Unit 24 - Lighting for Performance",null,null,null,null,null,"Unit 21 - Land-based Outdoor and Adventurous Activity Leadership",{"$f":"IF(COUNTIF(Diploma!list1,CW7)>=1,\"\",ROW())","v":7},"Unit 21 - Land-based Outdoor and Adventurous Activity Leadership",null,null,null,null,null,"Unit 14 - Writing for Digital Media",{"$f":"IF(COUNTIF('Extended Certificate'!$G$31:$G$37,DE7)>=1,\"\",ROW())","v":7},"Unit 14 - Writing for Digital Media",null,"Unit 29 - Drawing from Observation",{"$f":"IF(COUNTIF(Diploma!list1,DI7)>=1,\"\",ROW())","v":7},"Unit 29 - Drawing from Observation",null,"Unit 22 - Designing Products",{"$f":"IF(COUNTIF(Diploma!list1,DM7)>=1,\"\",ROW())","v":7},"Unit 22 - Designing Products",null,"Unit 26 - Moving Image Briefs",{"$f":"IF(COUNTIF(Diploma!list1,DQ7)>=1,\"\",ROW())","v":7},"Unit 26 - Moving Image Briefs",null,"Unit 12 - Textiles Briefs",{"$f":"IF(COUNTIF(Diploma!list1,DU7)>=1,\"\",ROW())","v":7},"Unit 12 - Textiles Briefs",null,"Unit 26 - Moving Image Briefs",{"$f":"IF(COUNTIF(Diploma!list1,DY7)>=1,\"\",ROW())","v":7},"Unit 26 - Moving Image Briefs",null,"Unit 17 - Art, Craft and Design in the Creative Industries",{"$f":"IF(COUNTIF(Diploma!list1,EC7)>=1,\"\",ROW())","v":7},"Unit 17 - Art, Craft and Design in the Creative Industries",null,null,null,null,null,{"$f":"IF(OR(AF15=1,AF12=1),\"\",\"Unit 16 - Managing Finance in Hospitality\")","v":"Unit 16 - Managing Finance in Hospitality"},7,"Unit 16 - Managing Finance in Hospitality",null,"Unit 18 - Developing Modern Music Production Skills",7,"Unit 18 - Developing Modern Music Production Skills",null,"Unit 14 - Growing Plants for Food ",{"$f":"IF(COUNTIF('Extended Certificate'!$G$21:$G$29,ES7)>=1,\"\",ROW())","v":7},"Unit 14 - Growing Plants for Food ",null,"Unit 10 - Adventurous Activities in the Public Services",{"$f":"IF(COUNTIF('Extended Certificate'!$G$21:$G$29,EW7)>=1,\"\",ROW())","v":7},"Unit 10 - Adventurous Activities in the Public Services",null,"Unit 15 - Public Sector Business",7,"Unit 15 - Public Sector Business",null,{"$f":"IF(OR(P20=1,P23=1,P26=1,P29=1),\"\",\"Unit 10 - Exploring Electrical Principles and Techniques\")","v":"Unit 10 - Exploring Electrical Principles and Techniques"},7,"Unit 10 - Exploring Electrical Principles and Techniques",null,null,null,null,null,"Unit 17 - Digital Audio Mixing",7,"Unit 17 - Digital Audio Mixing",null,"Unit 16 - Vehicle Electrical Systems",7,"Unit 16 - Vehicle Electrical Systems",null,"Unit 23 - Food Safety in Health and Social Care",7,"Unit 23 - Food Safety in Health and Social Care",null,"Unit 9 - Spreadsheet Development",7,"Unit 9 - Spreadsheet Development",null,"Unit 9 - Spreadsheet Development",{"$f":"IF(COUNTIF(Diploma!list1,GC7)>=1,\"\",ROW())","v":7},"Unit 9 - Spreadsheet Development",null,"Unit 9 - Spreadsheet Development",{"$f":"IF(COUNTIF(Diploma!list1,GG7)>=1,\"\",ROW())","v":7},"Unit 9 - Spreadsheet Development",null,"Unit 20 - Law and its Impact on the Individual",{"$f":"IF(COUNTIF(Diploma!list1,GK7)>=1,\"\",ROW())","v":7},"Unit 20 - Law and its Impact on the Individual",null,{"$f":"IF(GK23=1,\"\",\"Unit 10 - Adventurous Activities in the Public Services\")","v":"Unit 10 - Adventurous Activities in the Public Services"},7,"Unit 10 - Adventurous Activities in the Public Services",null,"Unit 12 - The Sport and Active Leisure Industry",7,"Unit 12 - The Sport and Active Leisure Industry",null,null,null,null,null,"Unit 12 - The Sport and Active Leisure Industry",7,"Unit 12 - The Sport and Active Leisure Industry",null,null,null,null,null,"Unit 16 - The Provision of Sport and Active Leisure",7,"Unit 16 - The Provision of Sport and Active Leisure",null,"Unit 18 - The Cruise Industry",7,"Unit 18 - The Cruise Industry",null,null,null,null,null,"Unit 18 - Computer Numerical Control Programming",7,"Unit 18 - Computer Numerical Control Programming",null,null,null,null,null,"Unit 23 - Electronic Devices and Communication Applications",7,"Unit 23 - Electronic Devices and Communication Applications",null,null,null,null,null,"Unit 13 - Engineering Assembly",7,"Unit 13 - Engineering Assembly",null,null,null,null,null,"Unit 14 - Vehicle Engines and Other Systems",7,"Unit 14 - Vehicle Engines and Other Systems"]
["Unit 12 - Textiles Briefs",{"$f":"IF(COUNTIF(Diploma!list1,A8)>=1,\"\",ROW())","v":8},"Unit 12 - Textiles Briefs",null,"Unit 25 - Introducing International Business",{"$f":"IF(COUNTIF(Diploma!list1,E8)>=1,\"\",ROW())","v":8},"Unit 25 - Introducing International Business",null,null,null,null,null,{"$f":"IF(OR(P20=1,P23=1,P26=1,P29=1,P32=1),\"\",\"Unit 25 - Exploring Building Services Engineering\")","v":"Unit 25 - Exploring Building Services Engineering"},{"$f":"IF(COUNTIF(Diploma!list1,M8)>=1,\"\",ROW())","v":8},"Unit 25 - Exploring Building Services Engineering",null,null,null,null,null,null,null,null,null,"Unit 20 - Understanding Disability",{"$f":"IF(COUNTIF(Diploma!list1,Y8)>=1,\"\",ROW())","v":8},"Unit 20 - Understanding Disability",null,null,null,null,null,null,null,null,null,"Unit 16 - Automated Computer Systems",{"$f":"IF(COUNTIF(Diploma!list1,AK8)>=1,\"\",ROW())","v":8},"Unit 16 - Automated Computer Systems",null,"Unit 10 - Introducing Music Theory",{"$f":"IF(COUNTIF(Diploma!list1,AO8)>=1,\"\",ROW())","v":8},"Unit 10 - Introducing Music Theory",null,null,null,null,null,"Unit 16 - Contemporary Dance Techniques",8,"Unit 16 - Contemporary Dance Techniques",null,"Unit 15 - Performing Scripted Plays",{"$f":"IF(COUNTIF(Certificate!$G$23:$G$25,BA8)>=1,\"\",ROW())","v":8},"Unit 15 - Performing Scripted Plays",null,"Unit 33 - Planning and Managing a Performing Arts Event",{"$f":"IF(COUNTIF(Diploma!list1,BE8)>=1,\"\",ROW())","v":8},"Unit 33 - Planning and Managing a Performing Arts Event",null,"Unit 28 - Make-up for Performance",8,"Unit 28 - Make-up for Performance",null,"Unit 25 - Sound for Performance",{"$f":"IF(COUNTIF('Extended Certificate'!$G$39,BM8)>=1,\"\",ROW())","v":8},"Unit 25 - Sound for Performance",null,null,null,null,null,"Unit 18 - Jazz Dance Techniques",{"$f":"IF(COUNTIF(Diploma!list1,BU8)>=1,\"\",ROW())","v":8},"Unit 18 - Jazz Dance Techniques",null,"Unit 39 - Work Experience in the Performing Arts",8,"Unit 39 - Work Experience in the Performing Arts",null,"Unit 25 - Sound for Performance",{"$f":"IF(COUNTIF('Extended Certificate'!$G$39,CC8)>=1,\"\",ROW())","v":8},"Unit 25 - Sound for Performance",null,null,null,null,null,"Unit 21 - Realising Set Design for Performance",{"$f":"IF(COUNTIF(Certificate!$G$23:$G$25,CK8)>=1,\"\",ROW())","v":8},"Unit 21 - Realising Set Design for Performance",null,"Unit 25 - Sound for Performance",{"$f":"IF(COUNTIF(Diploma!list1,CO8)>=1,\"\",ROW())","v":8},"Unit 25 - Sound for Performance",null,null,null,null,null,"Unit 22 - Water-based Outdoor and Adventurous Activity Leadership",{"$f":"IF(COUNTIF(Diploma!list1,CW8)>=1,\"\",ROW())","v":8},"Unit 22 - Water-based Outdoor and Adventurous Activity Leadership",null,null,null,null,null,"Unit 15 - Digital Games Testing",{"$f":"IF(COUNTIF('Extended Certificate'!$G$31:$G$37,DE8)>=1,\"\",ROW())","v":8},"Unit 15 - Digital Games Testing",null,"Unit 30 - Ceramics",{"$f":"IF(COUNTIF(Diploma!list1,DI8)>=1,\"\",ROW())","v":8},"Unit 30 - Ceramics",null,"Unit 25 - Fashion Promotion",{"$f":"IF(COUNTIF(Diploma!list1,DM8)>=1,\"\",ROW())","v":8},"Unit 25 - Fashion Promotion",null,"Unit 31 - Studio Photography",{"$f":"IF(COUNTIF(Diploma!list1,DQ8)>=1,\"\",ROW())","v":8},"Unit 31 - Studio Photography",null,"Unit 17 - Art, Craft and Design in the Creative Industries",{"$f":"IF(COUNTIF(Diploma!list1,DU8)>=1,\"\",ROW())","v":8},"Unit 17 - Art, Craft and Design in the Creative Industries",null,"Unit 28 - Printmaking Briefs",{"$f":"IF(COUNTIF(Diploma!list1,DY8)>=1,\"\",ROW())","v":8},"Unit 28 - Printmaking Briefs",null,"Unit 19 - Digital Art and Design Briefs",{"$f":"IF(COUNTIF(Diploma!list1,EC8)>=1,\"\",ROW())","v":8},"Unit 19 - Digital Art and Design Briefs",null,null,null,null,null,{"$f":"IF(OR(AF15=1,AF12=1),\"\",\"Unit 17 - Alcohol Awareness in Hospitality\")","v":"Unit 17 - Alcohol Awareness in Hospitality"},8,"Unit 17 - Alcohol Awareness in Hospitality",null,"Unit 19 - Developing Music Theory",8,"Unit 19 - Developing Music Theory",null,"Unit 15 - Investigating a Crime Scene ",{"$f":"IF(COUNTIF('Extended Certificate'!$G$21:$G$29,ES8)>=1,\"\",ROW())","v":8},"Unit 15 - Investigating a Crime Scene ",null,"Unit 11 - Sport and Recreation in the Public Services",{"$f":"IF(COUNTIF('Extended Certificate'!$G$21:$G$29,EW8)>=1,\"\",ROW())","v":8},"Unit 11 - Sport and Recreation in the Public Services",null,"Unit 17 - Visual Merchandising in Retail Business",8,"Unit 17 - Visual Merchandising in Retail Business",null,{"$f":"IF(OR(P20=1,P23=1,P26=1,P29=1,P32=1),\"\",\"Unit 13 - Exploring Roofing Principles and Techniques\")","v":"Unit 13 - Exploring Roofing Principles and Techniques"},8,"Unit 13 - Exploring Roofing Principles and Techniques",null,null,null,null,null,"Unit 18 - Lighting for Moving Image",8,"Unit 18 - Lighting for Moving Image",null,"Unit 17 - Welding",8,"Unit 17 - Welding",null,"Unit 24 - Infection Control in Health and Social Care",8,"Unit 24 - Infection Control in Health and Social Care",null,"Unit 20 - Building a Personal Computer",8,"Unit 20 - Building a Personal Computer",null,"Unit 10 - Database Development",{"$f":"IF(COUNTIF(Diploma!list1,GC8)>=1,\"\",ROW())","v":8},"Unit 10 - Database Development",null,"Unit 10 - Database Development",{"$f":"IF(COUNTIF(Diploma!list1,GG8)>=1,\"\",ROW())","v":8},"Unit 10 - Database Development",null,null,null,null,null,"Unit 11 - Sport and Recreation in the Public Services",8,"Unit 11 - Sport and Recreation in the Public Services",null,"Unit 13 - Profiling Sports Performance",8,"Unit 13 - Profiling Sports Performance",null,null,null,null,null,"Unit 13 - Profiling Sports Performance",8,"Unit 13 - Profiling Sports Performance",null,null,null,null,null,"Unit 23 - Sport Community Volunteering",8,"Unit 23 - Sport Community Volunteering",null,"Unit 19 - Hospitality Operations in the Travel and Tourism Sector",8,"Unit 19 - Hospitality Operations in the Travel and Tourism Sector",null,null,null,null,null,"Unit 20 - Sustainable Vehicle Power and Structure Design",8,"Unit 20 - Sustainable Vehicle Power and Structure Design",null,null,null,null,null,"Unit 30 - Vehicle Maintenance Techniques",8,"Unit 30 - Vehicle Maintenance Techniques",null,null,null,null,null,"Unit 17 - Welding",8,"Unit 17 - Welding",null,null,null,null,null,"Unit 17 - Welding",8,"Unit 17 - Welding"]
[{"$f":"IF(OR(A39=1,A48=1),\"\",\"Unit 13 - Visual Arts Briefs\")","v":"Unit 13 - Visual Arts Briefs"},{"$f":"IF(COUNTIF(Diploma!list1,A9)>=1,\"\",ROW())","v":9},"Unit 13 - Visual Arts Briefs",null,"Unit 26 - Introducing the Economic Environment",{"$f":"IF(COUNTIF(Diploma!list1,E9)>=1,\"\",ROW())","v":9},"Unit 26 - Introducing the Economic Environment",null,null,null,null,null,{"$f":"IF(OR(P20=1,P23=1,P26=1,P29=1,P32=1),\"\",\"Unit 26 - Exploring Facilities Management\")","v":"Unit 26 - Exploring Facilities Management"},{"$f":"IF(COUNTIF(Diploma!list1,M9)>=1,\"\",ROW())","v":9},"Unit 26 - Exploring Facilities Management",null,null,null,null,null,null,null,null,null,"Unit 21 - Introduction to Dementia",{"$f":"IF(COUNTIF(Diploma!list1,Y9)>=1,\"\",ROW())","v":9},"Unit 21 - Introduction to Dementia",null,null,null,null,null,null,null,null,null,"Unit 21 - A Technology Business",{"$f":"IF(COUNTIF(Diploma!list1,AK9)>=1,\"\",ROW())","v":9},"Unit 21 - A Technology Business",null,null,null,null,null,null,null,null,null,"Unit 17 - Exploring Urban Dance Styles",9,"Unit 17 - Exploring Urban Dance Styles",null,"Unit 16 - Contemporary Dance Techniques",{"$f":"IF(COUNTIF(Certificate!$G$23:$G$25,BA9)>=1,\"\",ROW())","v":9},"Unit 16 - Contemporary Dance Techniques",null,"Unit 35 - Physical Theatre Performance",{"$f":"IF(COUNTIF(Diploma!list1,BE9)>=1,\"\",ROW())","v":9},"Unit 35 - Physical Theatre Performance",null,"Unit 38 - Use of ICT in the Performing Arts",9,"Unit 38 - Use of ICT in the Performing Arts",null,"Unit 28 - Make-up for Performance",{"$f":"IF(COUNTIF('Extended Certificate'!$G$39,BM9)>=1,\"\",ROW())","v":9},"Unit 28 - Make-up for Performance",null,null,null,null,null,"Unit 30 - Choreographing Dance",{"$f":"IF(COUNTIF(Diploma!list1,BU9)>=1,\"\",ROW())","v":9},"Unit 30 - Choreographing Dance",null,null,null,null,null,"Unit 28 - Make-up for Performance",{"$f":"IF(COUNTIF('Extended Certificate'!$G$39,CC9)>=1,\"\",ROW())","v":9},"Unit 28 - Make-up for Performance",null,null,null,null,null,"Unit 22 - Realising Prop Design for Performance",{"$f":"IF(COUNTIF(Certificate!$G$23:$G$25,CK9)>=1,\"\",ROW())","v":9},"Unit 22 - Realising Prop Design for Performance",null,"Unit 26 - Supporting Performance: Stage Management",{"$f":"IF(COUNTIF(Diploma!list1,CO9)>=1,\"\",ROW())","v":9},"Unit 26 - Supporting Performance: Stage Management",null,null,null,null,null,"Unit 24 - Work Experience in Sport",{"$f":"IF(COUNTIF(Diploma!list1,CW9)>=1,\"\",ROW())","v":9},"Unit 24 - Work Experience in Sport",null,null,null,null,null,"Unit 16 - Digital Art for a Media Product ",{"$f":"IF(COUNTIF('Extended Certificate'!$G$31:$G$37,DE9)>=1,\"\",ROW())","v":9},"Unit 16 - Digital Art for a Media Product ",null,"Unit 36 - Surface Design",{"$f":"IF(COUNTIF(Diploma!list1,DI9)>=1,\"\",ROW())","v":9},"Unit 36 - Surface Design",null,"Unit 28 - Printmaking Briefs",{"$f":"IF(COUNTIF(Diploma!list1,DM9)>=1,\"\",ROW())","v":9},"Unit 28 - Printmaking Briefs",null,"Unit 32 - Location Photography",{"$f":"IF(COUNTIF(Diploma!list1,DQ9)>=1,\"\",ROW())","v":9},"Unit 32 - Location Photography",null,{"$f":"IF(DU24=1,\"\",\"Unit 18 - 3D Design Briefs\")","v":"Unit 18 - 3D Design Briefs"},{"$f":"IF(COUNTIF(Diploma!list1,DU9)>=1,\"\",ROW())","v":9},"Unit 18 - 3D Design Briefs",null,"Unit 29 - Drawing from Observation",{"$f":"IF(COUNTIF(Diploma!list1,DY9)>=1,\"\",ROW())","v":9},"Unit 29 - Drawing from Observation",null,"Unit 20 - Interactive Media Production Briefs",{"$f":"IF(COUNTIF(Diploma!list1,EC9)>=1,\"\",ROW())","v":9},"Unit 20 - Interactive Media Production Briefs",null,null,null,null,null,{"$f":"IF(OR(AF15=1,AF12=1),\"\",\"Unit 19 - Hospitality Research Project\")","v":"Unit 19 - Hospitality Research Project"},9,"Unit 19 - Hospitality Research Project",null,"Unit 20 - Music Fusion",9,"Unit 20 - Music Fusion",null,"Unit 16 - Science in Medicine ",{"$f":"IF(COUNTIF('Extended Certificate'!$G$21:$G$29,ES9)>=1,\"\",ROW())","v":9},"Unit 16 - Science in Medicine ",null,"Unit 12 - Land Navigation by Map and Compass",{"$f":"IF(COUNTIF('Extended Certificate'!$G$21:$G$29,EW9)>=1,\"\",ROW())","v":9},"Unit 12 - Land Navigation by Map and Compass",null,"Unit 30 - Corporate Social Responsibility",9,"Unit 30 - Corporate Social Responsibility",null,{"$f":"IF(OR(P20=1,P23=1,P26=1,P29=1,P32=1),\"\",\"Unit 14 - Exploring Wall and Floor Tiling Principles and Techniques\")","v":"Unit 14 - Exploring Wall and Floor Tiling Principles and Techniques"},9,"Unit 14 - Exploring Wall and Floor Tiling Principles and Techniques",null,null,null,null,null,null,null,null,null,"Unit 19 - Bicycle Servicing and Maintenance",9,"Unit 19 - Bicycle Servicing and Maintenance",null,"Unit 25 - Using ICT in Health and Social Care",9,"Unit 25 - Using ICT in Health and Social Care",null,"Unit 25 - IT Work Experience",9,"Unit 25 - IT Work Experience",null,"Unit 11 - Computer Networks",{"$f":"IF(COUNTIF(Diploma!list1,GC9)>=1,\"\",ROW())","v":9},"Unit 11 - Computer Networks",null,"Unit 12 - Software Development",{"$f":"IF(COUNTIF(Diploma!list1,GG9)>=1,\"\",ROW())","v":9},"Unit 12 - Software Development",null,null,null,null,null,"Unit 15 - Health and Safety in the Public Services",9,"Unit 15 - Health and Safety in the Public Services",null,"Unit 16 - The Provision of Sport and Active Leisure",9,"Unit 16 - The Provision of Sport and Active Leisure",null,null,null,null,null,"Unit 15 - Designing Exercise Programmes",9,"Unit 15 - Designing Exercise Programmes",null,null,null,null,null,null,null,null,null,"Unit 20 - UK Visitor Attractions",9,"Unit 20 - UK Visitor Attractions",null,null,null,null,null,null,null,null,null,null,null,null,null,null,null,null,null,null,null,null,null,"Unit 18 - Computer Numerical Control Programming",9,"Unit 18 - Computer Numerical Control Programming",null,null,null,null,null,"Unit 18 - Computer Numerical Control Programming",9,"Unit 18 - Computer Numerical Control Programming"]
["Unit 14 - Photography Briefs",{"$f":"IF(COUNTIF(Diploma!list1,A10)>=1,\"\",ROW())","v":10},"Unit 14 - Photography Briefs",null,"Unit 27 - Efficient Business Operations",{"$f":"IF(COUNTIF(Diploma!list1,E10)>=1,\"\",ROW())","v":10},"Unit 27 - Efficient Business Operations",null,null,null,null,null,null,null,null,null,null,null,null,null,null,null,null,null,null,null,null,null,null,null,null,null,null,null,null,null,"Unit 22 - Computer Security in Practice",{"$f":"IF(COUNTIF(Diploma!list1,AK10)>=1,\"\",ROW())","v":10},"Unit 22 - Computer Security in Practice",null,null,null,null,null,null,null,null,null,"Unit 18 - Jazz Dance Techniques",10,"Unit 18 - Jazz Dance Techniques",null,"Unit 17 - Exploring Urban Dance Styles",{"$f":"IF(COUNTIF(Certificate!$G$23:$G$25,BA10)>=1,\"\",ROW())","v":10},"Unit 17 - Exploring Urban Dance Styles",null,"Unit 36 - Variety Performance",{"$f":"IF(COUNTIF(Diploma!list1,BE10)>=1,\"\",ROW())","v":10},"Unit 36 - Variety Performance",null,"Unit 39 - Work Experience in the Performing Arts",10,{"$f":"IF(ROW(BI10)-ROW(BI$2)+1>COUNT(BJ$2:BJ$10),\"\",INDEX(BI:BI,SMALL(BJ$2:BJ$10,1+ROW(BI10)-ROW(BI$2))))","v":"Unit 39 - Work Experience in the Performing Arts"},null,"Unit 29 - Wardrobe for Stage Performance",{"$f":"IF(COUNTIF('Extended Certificate'!$G$39,BM10)>=1,\"\",ROW())","v":10},"Unit 29 - Wardrobe for Stage Performance",null,null,null,null,null,"Unit 35 - Physical Theatre Performance",{"$f":"IF(COUNTIF(Diploma!list1,BU10)>=1,\"\",ROW())","v":10},"Unit 35 - Physical Theatre Performance",null,null,null,null,null,"Unit 29 - Wardrobe for Stage Performance",{"$f":"IF(COUNTIF('Extended Certificate'!$G$39,CC10)>=1,\"\",ROW())","v":10},"Unit 29 - Wardrobe for Stage Performance",null,null,null,null,null,"Unit 23 - Realising Mask Design for Performance",{"$f":"IF(COUNTIF(Certificate!$G$23:$G$25,CK10)>=1,\"\",ROW())","v":10},"Unit 23 - Realising Mask Design for Performance",null,"Unit 27 - Supporting Performance: Front of House",{"$f":"IF(COUNTIF(Diploma!list1,CO10)>=1,\"\",ROW())","v":10},"Unit 27 - Supporting Performance: Front of House",null,null,null,null,null,null,null,null,null,null,null,null,null,"Unit 17 - Digital Audio Mixing ",{"$f":"IF(COUNTIF('Extended Certificate'!$G$31:$G$37,DE10)>=1,\"\",ROW())","v":10},"Unit 17 - Digital Audio Mixing ",null,"Unit 37 - Sustainability in Art and Design Practice",{"$f":"IF(COUNTIF(Diploma!list1,DI10)>=1,\"\",ROW())","v":10},"Unit 37 - Sustainability in Art and Design Practice",null,"Unit 29 - Drawing from Observation",{"$f":"IF(COUNTIF(Diploma!list1,DM10)>=1,\"\",ROW())","v":10},"Unit 29 - Drawing from Observation",null,"Unit 33 - Designing for Print and Screen",{"$f":"IF(COUNTIF(Diploma!list1,DQ10)>=1,\"\",ROW())","v":10},"Unit 33 - Designing for Print and Screen",null,"Unit 19 - Digital Art and Design Briefs",{"$f":"IF(COUNTIF(Diploma!list1,DU10)>=1,\"\",ROW())","v":10},"Unit 19 - Digital Art and Design Briefs",null,"Unit 30 - Ceramics",{"$f":"IF(COUNTIF(Diploma!list1,DY10)>=1,\"\",ROW())","v":10},"Unit 30 - Ceramics",null,"Unit 26 - Moving Image Briefs",{"$f":"IF(COUNTIF(Diploma!list1,EC10)>=1,\"\",ROW())","v":10},"Unit 26 - Moving Image Briefs",null,null,null,null,null,{"$f":"IF(OR(AF15=1,AF12=1),\"\",IF(EK21=1,\"\",\"Unit 20 - Work Experience in Hospitality\"))","v":"Unit 20 - Work Experience in Hospitality"},10,"Unit 20 - Work Experience in Hospitality",null,"Unit 21 - Music Arrangement",10,"Unit 21 - Music Arrangement",null,"Unit 17 - Understanding Human Behaviour ",{"$f":"IF(COUNTIF('Extended Certificate'!$G$21:$G$29,ES10)>=1,\"\",ROW())","v":10},"Unit 17 - Understanding Human Behaviour ",null,"Unit 13 - Volunteering for the Public Services",{"$f":"IF(COUNTIF('Extended Certificate'!$G$21:$G$29,EW10)>=1,\"\",ROW())","v":10},"Unit 13 - Volunteering for the Public Services",null,"Unit 31 - Managing Personal Finances",10,"Unit 31 - Managing Personal Finances",null,{"$f":"IF(OR(P20=1,P23=1,P26=1,P29=1,P32=1),\"\",\"Unit 15 - Exploring Plastering and Dry Lining Principles and Techniques\")","v":"Unit 15 - Exploring Plastering and Dry Lining Principles and Techniques"},10,"Unit 15 - Exploring Plastering and Dry Lining Principles and Techniques",null,null,null,null,null,null,null,null,null,"Unit 20 - Sustainable Vehicle Power and Structure Design",10,"Unit 20 - Sustainable Vehicle Power and Structure Design",null,null,null,null,null,null,null,null,null,"Unit 13 - Website Development",{"$f":"IF(COUNTIF(Diploma!list1,GC10)>=1,\"\",ROW())","v":10},"Unit 13 - Website Development",null,"Unit 13 - Website Development",{"$f":"IF(COUNTIF(Diploma!list1,GG10)>=1,\"\",ROW())","v":10},"Unit 13 - Website Development",null,null,null,null,null,null,null,null,null,"Unit 23 - Sport Community Volunteering",10,"Unit 23 - Sport Community Volunteering",null,null,null,null,null,"Unit 16 - The Provision of Sport and Active Leisure",10,"Unit 16 - The Provision of Sport and Active Leisure",null,null,null,null,null,null,null,null,null,"Unit 21 - Overseas Holiday Operations",10,"Unit 21 - Overseas Holiday Operations",null,null,null,null,null,null,null,null,null,null,null,null,null,null,null,null,null,null,null,null,null,"Unit 28 - Fabrication Techniques",10,"Unit 28 - Fabrication Techniques",null,null,null,null,null,"Unit 31 - Production Planning for Engineering",10,"Unit 31 - Production Planning for Engineering"]
["Unit 15 - Designing for the Future",{"$f":"IF(COUNTIF(Diploma!list1,A11)>=1,\"\",ROW())","v":11},"Unit 15 - Designing for the Future",null,"Unit 28 - Principles of Procurement and Supply",{"$f":"IF(COUNTIF(Diploma!list1,E11)>=1,\"\",ROW())","v":11},"Unit 28 - Principles of Procurement and Supply",null,null,null,null,null,null,null,null,null,null,null,null,null,null,null,null,null,null,null,null,null,"Unit 4",null,"Unit 16","Forbidden",null,null,null,null,"Unit 23 - Computer Systems Support in Practice",{"$f":"IF(COUNTIF(Diploma!list1,AK11)>=1,\"\",ROW())","v":11},"Unit 23 - Computer Systems Support in Practice",null,null,null,null,null,null,null,null,null,"Unit 19 - Design Planning for Performance",11,"Unit 19 - Design Planning for Performance",null,"Unit 18 - Jazz Dance Techniques",{"$f":"IF(COUNTIF(Certificate!$G$23:$G$25,BA11)>=1,\"\",ROW())","v":11},"Unit 18 - Jazz Dance Techniques",null,"Unit 40 - Singing Skills in the Performing Arts",{"$f":"IF(COUNTIF(Diploma!list1,BE11)>=1,\"\",ROW())","v":11},"Unit 40 - Singing Skills in the Performing Arts",null,null,null,null,null,null,null,null,null,null,null,null,null,"Unit 36 - Variety Performance",{"$f":"IF(COUNTIF(Diploma!list1,BU11)>=1,\"\",ROW())","v":11},"Unit 36 - Variety Performance",null,null,null,null,null,null,null,null,null,null,null,null,null,"Unit 24 - Lighting for Performance",{"$f":"IF(COUNTIF(Certificate!$G$23:$G$25,CK11)>=1,\"\",ROW())","v":11},"Unit 24 - Lighting for Performance",null,"Unit 28 - Make-up for Performance",{"$f":"IF(COUNTIF(Diploma!list1,CO11)>=1,\"\",ROW())","v":11},"Unit 28 - Make-up for Performance",null,null,null,null,null,null,null,null,null,null,null,null,null,"Unit 18 - Lighting for Moving Image  ",{"$f":"IF(COUNTIF('Extended Certificate'!$G$31:$G$37,DE11)>=1,\"\",ROW())","v":11},{"$f":"IF(ROW(DE11)-ROW(DE$2)+1>COUNT(DF$2:DF$11),\"\",INDEX(DE:DE,SMALL(DF$2:DF$11,1+ROW(DE11)-ROW(DE$2))))","v":"Unit 18 - Lighting for Moving Image  "},null,"Unit 39 - Modelmaking",{"$f":"IF(COUNTIF(Diploma!list1,DI11)>=1,\"\",ROW())","v":11},"Unit 39 - Modelmaking",null,"Unit 33 - Designing for Print and Screen",{"$f":"IF(COUNTIF(Diploma!list1,DM11)>=1,\"\",ROW())","v":11},"Unit 33 - Designing for Print and Screen",null,"Unit 34 - Editing Photographic Images",{"$f":"IF(COUNTIF(Diploma!list1,DQ11)>=1,\"\",ROW())","v":11},"Unit 34 - Editing Photographic Images",null,"Unit 20 - Interactive Media Production Briefs",{"$f":"IF(COUNTIF(Diploma!list1,DU11)>=1,\"\",ROW())","v":11},"Unit 20 - Interactive Media Production Briefs",null,"Unit 37 - Sustainability in Art and Design Practice",{"$f":"IF(COUNTIF(Diploma!list1,DY11)>=1,\"\",ROW())","v":11},"Unit 37 - Sustainability in Art and Design Practice",null,"Unit 27 - Interaction Design",{"$f":"IF(COUNTIF(Diploma!list1,EC11)>=1,\"\",ROW())","v":11},"Unit 27 - Interaction Design",null,null,null,null,null,{"$f":"IF(OR(AF15=1,AF12=1),\"\",IF(EK18=1,\"\",\"Unit 21 - Hospitality Community Volunteering\"))","v":"Unit 21 - Hospitality Community Volunteering"},11,"Unit 21 - Hospitality Community Volunteering",null,"Unit 22 - Exploring Music Improvisation",11,"Unit 22 - Exploring Music Improvisation",null,"Unit 18 - Designing and Making Useful Devices in Science",{"$f":"IF(COUNTIF('Extended Certificate'!$G$21:$G$29,ES11)>=1,\"\",ROW())","v":11},"Unit 18 - Designing and Making Useful Devices in Science",null,"Unit 14 - Multi-day Expedition Experience",{"$f":"IF(COUNTIF('Extended Certificate'!$G$21:$G$29,EW11)>=1,\"\",ROW())","v":11},"Unit 14 - Multi-day Expedition Experience",null,"Unit 32 - Sustainability in the Business Workplace",11,"Unit 32 - Sustainability in the Business Workplace",null,{"$f":"IF(OR(P20=1,P23=1,P26=1,P29=1,P32=1),\"\",\"Unit 19 - Plumbing Operations\")","v":"Unit 19 - Plumbing Operations"},11,"Unit 19 - Plumbing Operations",null,null,null,null,null,null,null,null,null,"Unit 22 - Continuous Improvement and Problem-Solving",11,"Unit 22 - Continuous Improvement and Problem-Solving",null,null,null,null,null,null,null,null,null,"Unit 14 - Installing and Maintaining Computer Hardware",{"$f":"IF(COUNTIF(Diploma!list1,GC11)>=1,\"\",ROW())","v":11},"Unit 14 - Installing and Maintaining Computer Hardware",null,"Unit 14 - Installing and Maintaining Computer Hardware",{"$f":"IF(COUNTIF(Diploma!list1,GG11)>=1,\"\",ROW())","v":11},"Unit 14 - Installing and Maintaining Computer Hardware",null,null,null,null,null,null,null,null,null,null,null,null,null,null,null,null,null,"Unit 17 - Facility Operations for Sport and Leisure",11,"Unit 17 - Facility Operations for Sport and Leisure",null,null,null,null,null,null,null,null,null,null,null,null,null,null,null,null,null,null,null,null,null,null,null,null,null,null,null,null,null,null,null,null,null,"Unit 29 - Casting Techniques",11,"Unit 29 - Casting Techniques",null,null,null,null,null,"Unit 32 - Engineering Marking Out",11,"Unit 32 - Engineering Marking Out"]
["Unit 16 - Applying Contextual References in Art and Design",{"$f":"IF(COUNTIF(Diploma!list1,A12)>=1,\"\",ROW())","v":12},"Unit 16 - Applying Contextual References in Art and Design",null,"Unit 29 - Implementing Procurement and Supply in Business",{"$f":"IF(COUNTIF(Diploma!list1,E12)>=1,\"\",ROW())","v":12},"Unit 29 - Implementing Procurement and Supply in Business",null,null,null,null,null,null,null,null,null,null,null,null,null,null,null,null,null,"Unit 16",null,null,null,{"$f":"COUNTIF(Diploma!$G$23:$G$31, \"Unit 4 - Costing and Controlling Finances in the Hospitality Industry\")","v":0},null,{"$f":"COUNTIF(Diploma!$G$33:$G$40, \"Unit 16 - Managing Finance in Hospitality\")","v":0},{"$f":"IF(AND(AC12=0,AE12=1),1,0)","v":0},null,null,null,null,"Unit 24 - Software Systems Development",{"$f":"IF(COUNTIF(Diploma!list1,AK12)>=1,\"\",ROW())","v":12},"Unit 24 - Software Systems Development",null,null,null,null,null,null,null,null,null,"Unit 20 - Realising Costume Design for Performance",12,"Unit 20 - Realising Costume Design for Performance",null,"Unit 19 - Design Planning for Performance",{"$f":"IF(COUNTIF(Certificate!$G$23:$G$25,BA12)>=1,\"\",ROW())","v":12},"Unit 19 - Design Planning for Performance",null,null,null,null,null,null,null,null,null,null,null,null,null,null,null,null,null,"Unit 40 - Singing Skills in the Performing Arts",{"$f":"IF(COUNTIF(Diploma!list1,BU12)>=1,\"\",ROW())","v":12},{"$f":"IF(ROW(BU12)-ROW(BU$2)+1>COUNT(BV$2:BV$12),\"\",INDEX(BU:BU,SMALL(BV$2:BV$12,1+ROW(BU12)-ROW(BU$2))))","v":"Unit 40 - Singing Skills in the Performing Arts"},null,null,null,null,null,null,null,null,null,null,null,null,null,"Unit 25 - Sound for Performance",{"$f":"IF(COUNTIF(Certificate!$G$23:$G$25,CK12)>=1,\"\",ROW())","v":12},"Unit 25 - Sound for Performance",null,"Unit 29 - Wardrobe for Stage Performance",{"$f":"IF(COUNTIF(Diploma!list1,CO12)>=1,\"\",ROW())","v":12},"Unit 29 - Wardrobe for Stage Performance",null,null,null,null,null,null,null,null,null,null,null,null,null,null,null,null,null,"Unit 40 - Sculpture",{"$f":"IF(COUNTIF(Diploma!list1,DI12)>=1,\"\",ROW())","v":12},"Unit 40 - Sculpture",null,"Unit 35 - Fashion Retail",{"$f":"IF(COUNTIF(Diploma!list1,DM12)>=1,\"\",ROW())","v":12},"Unit 35 - Fashion Retail",null,"Unit 37 - Sustainability in Art and Design Practice",{"$f":"IF(COUNTIF(Diploma!list1,DQ12)>=1,\"\",ROW())","v":12},"Unit 37 - Sustainability in Art and Design Practice",null,{"$f":"IF(DU24=1,\"\",\"Unit 22 - Designing Products\")","v":"Unit 22 - Designing Products"},{"$f":"IF(COUNTIF(Diploma!list1,DU12)>=1,\"\",ROW())","v":12},"Unit 22 - Designing Products",null,"Unit 39 - Modelmaking",{"$f":"IF(COUNTIF(Diploma!list1,DY12)>=1,\"\",ROW())","v":12},"Unit 39 - Modelmaking",null,"Unit 33 - Designing for Print and Screen",{"$f":"IF(COUNTIF(Diploma!list1,EC12)>=1,\"\",ROW())","v":12},"Unit 33 - Designing for Print and Screen",null,null,null,null,null,{"$f":"IF(OR(AF15=1,AF12=1),\"\",\"Unit 22 - Sales and Merchandising in Hospitality\")","v":"Unit 22 - Sales and Merchandising in Hospitality"},12,"Unit 22 - Sales and Merchandising in Hospitality",null,"Unit 23 - Exploring Djing",12,"Unit 23 - Exploring Djing",null,"Unit 19 - Chemical Analysis and Detection ",{"$f":"IF(COUNTIF('Extended Certificate'!$G$21:$G$29,ES12)>=1,\"\",ROW())","v":12},"Unit 19 - Chemical Analysis and Detection ",null,"Unit 15 - Health and Safety in the Public Services",{"$f":"IF(COUNTIF('Extended Certificate'!$G$21:$G$29,EW12)>=1,\"\",ROW())","v":12},"Unit 15 - Health and Safety in the Public Services",null,null,null,null,null,{"$f":"IF(OR(P20=1,P23=1,P26=1,P29=1,P32=1),\"\",\"Unit 20 - Electrical Operations\")","v":"Unit 20 - Electrical Operations"},12,"Unit 20 - Electrical Operations",null,null,null,null,null,null,null,null,null,"Unit 23 - Electronic Devices and Communication Applications",12,"Unit 23 - Electronic Devices and Communication Applications",null,null,null,null,null,null,null,null,null,"Unit 15 - Installing and Maintaining Computer Software",{"$f":"IF(COUNTIF(Diploma!list1,GC12)>=1,\"\",ROW())","v":12},"Unit 15 - Installing and Maintaining Computer Software",null,"Unit 15 - Installing and Maintaining Computer Software",{"$f":"IF(COUNTIF(Diploma!list1,GG12)>=1,\"\",ROW())","v":12},"Unit 15 - Installing and Maintaining Computer Software",null,null,null,null,null,null,null,null,null,null,null,null,null,null,null,null,null,"Unit 23 - Sport Community Volunteering",12,"Unit 23 - Sport Community Volunteering",null,null,null,null,null,null,null,null,null,null,null,null,null,null,null,null,null,null,null,null,null,null,null,null,null,null,null,null,null,null,null,null,null,"Unit 31 - Production Planning for Engineering",12,"Unit 31 - Production Planning for Engineering",null,null,null,null,null,"Unit 35 - Application of Quality Control and Measurement in Engineering",12,"Unit 35 - Application of Quality Control and Measurement in Engineering"]
["Unit 17 - Art, Craft and Design in the Creative Industries",{"$f":"IF(COUNTIF(Diploma!list1,A13)>=1,\"\",ROW())","v":13},"Unit 17 - Art, Craft and Design in the Creative Industries",null,null,null,null,null,null,null,null,null,null,null,null,null,null,null,null,null,null,null,null,null,{"$f":"COUNTIF(Diploma!$G$23:$G$31, \"Unit 16 - Vocational Experience in Health and Social Care\")","v":0},null,null,null,null,null,null,null,null,null,null,null,null,null,null,null,null,null,null,null,null,null,null,null,"Unit 21 - Realising Set Design for Performance",13,"Unit 21 - Realising Set Design for Performance",null,"Unit 20 - Realising Costume Design for Performance",{"$f":"IF(COUNTIF(Certificate!$G$23:$G$25,BA13)>=1,\"\",ROW())","v":13},"Unit 20 - Realising Costume Design for Performance",null,null,null,null,null,null,null,null,null,null,null,null,null,null,null,null,null,null,null,null,null,null,null,null,null,null,null,null,null,null,null,null,null,"Unit 28 - Make-up for Performance",{"$f":"IF(COUNTIF(Certificate!$G$23:$G$25,CK13)>=1,\"\",ROW())","v":13},"Unit 28 - Make-up for Performance",null,"Unit 33 - Planning and Managing a Performing Arts Event",{"$f":"IF(COUNTIF(Diploma!list1,CO13)>=1,\"\",ROW())","v":13},"Unit 33 - Planning and Managing a Performing Arts Event",null,null,null,null,null,null,null,null,null,null,null,null,null,null,null,null,null,null,null,null,null,"Unit 36 - Surface Design",{"$f":"IF(COUNTIF(Diploma!list1,DM13)>=1,\"\",ROW())","v":13},"Unit 36 - Surface Design",null,null,null,null,null,"Unit 24 - Design Thinking",{"$f":"IF(COUNTIF(Diploma!list1,DU13)>=1,\"\",ROW())","v":13},"Unit 24 - Design Thinking",null,"Unit 40 - Sculpture",{"$f":"IF(COUNTIF(Diploma!list1,DY13)>=1,\"\",ROW())","v":13},"Unit 40 - Sculpture",null,"Unit 34 - Editing Photographic Images",{"$f":"IF(COUNTIF(Diploma!list1,EC13)>=1,\"\",ROW())","v":13},"Unit 34 - Editing Photographic Images",null,null,null,null,null,{"$f":"IF(OR(AF15=1,AF12=1),\"\",\"Unit 23 - Barista Skills in Hospitality\")","v":"Unit 23 - Barista Skills in Hospitality"},13,{"$f":"IF(ROW(EK13)-ROW(EK$2)+1>COUNT(EL$2:EL$13),\"\",INDEX(EK:EK,SMALL(EL$2:EL$13,1+ROW(EK13)-ROW(EK$2))))","v":"Unit 23 - Barista Skills in Hospitality"},null,"Unit 24 - Music Promotion",13,"Unit 24 - Music Promotion",null,"Unit 20 - Exploring our Universe ",{"$f":"IF(COUNTIF('Extended Certificate'!$G$21:$G$29,ES13)>=1,\"\",ROW())","v":13},"Unit 20 - Exploring our Universe ",null,"Unit 16 - Employability Skills in the Public Services",{"$f":"IF(COUNTIF('Extended Certificate'!$G$21:$G$29,EW13)>=1,\"\",ROW())","v":13},"Unit 16 - Employability Skills in the Public Services",null,null,null,null,null,{"$f":"IF(OR(P20=1,P23=1,P26=1,P29=1,P32=1),\"\",\"Unit 27 - Construction Work Experience\")","v":"Unit 27 - Construction Work Experience"},13,"Unit 27 - Construction Work Experience",null,null,null,null,null,null,null,null,null,"Unit 24 - Operation and Maintenance of Mechanical Systems and \nComponents",13,"Unit 24 - Operation and Maintenance of Mechanical Systems and \nComponents",null,null,null,null,null,null,null,null,null,"Unit 16 - Automated Computer Systems",{"$f":"IF(COUNTIF(Diploma!list1,GC13)>=1,\"\",ROW())","v":13},"Unit 16 - Automated Computer Systems",null,"Unit 16 - Automated Computer Systems",{"$f":"IF(COUNTIF(Diploma!list1,GG13)>=1,\"\",ROW())","v":13},"Unit 16 - Automated Computer Systems",null,null,null,null,null,null,null,null,null,null,null,null,null,null,null,null,null,"Unit 24 - Work Experience in Sport",13,"Unit 24 - Work Experience in Sport",null,null,null,null,null,null,null,null,null,null,null,null,null,null,null,null,null,null,null,null,null,null,null,null,null,null,null,null,null,null,null,null,null,"Unit 35 - Application of Quality Control and Measurement in Engineering",13,"Unit 35 - Application of Quality Control and Measurement in Engineering"]
[{"$f":"IF(A48=1,\"\",\"Unit 18 - 3D Design Briefs\")","v":"Unit 18 - 3D Design Briefs"},{"$f":"IF(COUNTIF(Diploma!list1,A14)>=1,\"\",ROW())","v":14},"Unit 18 - 3D Design Briefs",null,null,null,null,null,null,null,null,null,null,null,null,null,null,null,null,null,null,null,null,null,null,null,null,null,"Unit 6",null,"Unit 13",null,null,null,null,null,null,null,null,null,null,null,null,null,null,null,null,null,"Unit 22 - Realising Prop Design for Performance",14,"Unit 22 - Realising Prop Design for Performance",null,"Unit 21 - Realising Set Design for Performance",{"$f":"IF(COUNTIF(Certificate!$G$23:$G$25,BA14)>=1,\"\",ROW())","v":14},"Unit 21 - Realising Set Design for Performance",null,null,null,null,null,null,null,null,null,null,null,null,null,null,null,null,null,null,null,null,null,null,null,null,null,null,null,null,null,null,null,null,null,"Unit 29 - Wardrobe for Stage Performance",{"$f":"IF(COUNTIF(Certificate!$G$23:$G$25,CK14)>=1,\"\",ROW())","v":14},"Unit 29 - Wardrobe for Stage Performance",null,"Unit 34 - Multimedia Production",{"$f":"IF(COUNTIF(Diploma!list1,CO14)>=1,\"\",ROW())","v":14},"Unit 34 - Multimedia Production",null,null,null,null,null,null,null,null,null,null,null,null,null,null,null,null,null,null,null,null,null,"Unit 37 - Sustainability in Art and Design Practice",{"$f":"IF(COUNTIF(Diploma!list1,DM14)>=1,\"\",ROW())","v":14},"Unit 37 - Sustainability in Art and Design Practice",null,null,null,null,null,"Unit 26 - Moving Image Briefs",{"$f":"IF(COUNTIF(Diploma!list1,DU14)>=1,\"\",ROW())","v":14},"Unit 26 - Moving Image Briefs",null,null,null,null,null,"Unit 37 - Sustainability in Art and Design Practice",{"$f":"IF(COUNTIF(Diploma!list1,EC14)>=1,\"\",ROW())","v":14},"Unit 37 - Sustainability in Art and Design Practice",null,null,null,null,null,null,null,null,null,"Unit 25 - Digital and Mobile Technology for Music",14,"Unit 25 - Digital and Mobile Technology for Music",null,"Unit 21 - Electronics in Action",{"$f":"IF(COUNTIF('Extended Certificate'!$G$21:$G$29,ES14)>=1,\"\",ROW())","v":14},"Unit 21 - Electronics in Action",null,"Unit 17 - Preparing to Respond to Emergency Incidents",{"$f":"IF(COUNTIF('Extended Certificate'!$G$21:$G$29,EW14)>=1,\"\",ROW())","v":14},"Unit 17 - Preparing to Respond to Emergency Incidents",null,null,null,null,null,{"$f":"IF(OR(P20=1,P23=1,P26=1,P29=1,P32=1),\"\",\"Unit 28 - Communications for Construction and the Built Environment\")","v":"Unit 28 - Communications for Construction and the Built Environment"},14,"Unit 28 - Communications for Construction and the Built Environment",null,null,null,null,null,null,null,null,null,"Unit 25 - Operation and Maintenance of Electronic Systems and \nComponents",14,"Unit 25 - Operation and Maintenance of Electronic Systems and \nComponents",null,null,null,null,null,null,null,null,null,"Unit 20 - Building a Personal Computer",{"$f":"IF(COUNTIF(Diploma!list1,GC14)>=1,\"\",ROW())","v":14},"Unit 20 - Building a Personal Computer",null,"Unit 20 - Building a Personal Computer",{"$f":"IF(COUNTIF(Diploma!list1,GG14)>=1,\"\",ROW())","v":14},"Unit 20 - Building a Personal Computer"]
["Unit 19 - Digital Art and Design Briefs",{"$f":"IF(COUNTIF(Diploma!list1,A15)>=1,\"\",ROW())","v":15},"Unit 19 - Digital Art and Design Briefs",null,null,null,null,null,null,null,null,null,null,null,null,null,null,null,null,null,null,null,null,null,"Unit 17",null,null,null,{"$f":"COUNTIF(Diploma!$G$23:$G$31, \"Unit 6 - Planning, Preparing, Cooking and Finishing Food\")","v":0},null,{"$f":"COUNTIF(Diploma!$G$33:$G$40, \"Unit 13 - Contemporary World Food Cooking Skills\")","v":0},{"$f":"IF(AND(AC15=0,AE15=1),1,0)","v":0},null,null,null,null,null,null,null,null,null,null,null,null,null,null,null,null,"Unit 23 - Realising Mask Design for Performance",15,"Unit 23 - Realising Mask Design for Performance",null,"Unit 22 - Realising Prop Design for Performance",{"$f":"IF(COUNTIF(Certificate!$G$23:$G$25,BA15)>=1,\"\",ROW())","v":15},"Unit 22 - Realising Prop Design for Performance",null,null,null,null,null,null,null,null,null,null,null,null,null,null,null,null,null,null,null,null,null,null,null,null,null,null,null,null,null,null,null,null,null,null,null,null,null,"Unit 38 - Use of ICT in the Performing Arts",{"$f":"IF(COUNTIF(Diploma!list1,CO15)>=1,\"\",ROW())","v":15},"Unit 38 - Use of ICT in the Performing Arts",null,null,null,null,null,null,null,null,null,null,null,null,null,null,null,null,null,null,null,null,null,null,null,null,null,null,null,null,null,"Unit 27 - Interaction Design",{"$f":"IF(COUNTIF(Diploma!list1,DU15)>=1,\"\",ROW())","v":15},"Unit 27 - Interaction Design",null,null,null,null,null,"Unit 38 - Advertising Briefs",{"$f":"IF(COUNTIF(Diploma!list1,EC15)>=1,\"\",ROW())","v":15},"Unit 38 - Advertising Briefs",null,null,null,null,null,{"$f":"IF(OR(AF15=1,AF12=1),\"\",\"1\")","v":"1"},null,null,null,"Unit 26 - Composing for Visual Media",15,"Unit 26 - Composing for Visual Media",null,"Unit 22 - Biotechnology Procedures and Applications",{"$f":"IF(COUNTIF('Extended Certificate'!$G$21:$G$29,ES15)>=1,\"\",ROW())","v":15},"Unit 22 - Biotechnology Procedures and Applications",null,"Unit 18 - Security Procedures in the Public Services",{"$f":"IF(COUNTIF('Extended Certificate'!$G$21:$G$29,EW15)>=1,\"\",ROW())","v":15},"Unit 18 - Security Procedures in the Public Services",null,null,null,null,null,null,null,null,null,null,null,null,null,null,null,null,null,"Unit 26 - Operation and Maintenance of Electrical Systems and \nComponents",15,"Unit 26 - Operation and Maintenance of Electrical Systems and \nComponents",null,null,null,null,null,null,null,null,null,"Unit 21 - A Technology Business",{"$f":"IF(COUNTIF(Diploma!list1,GC15)>=1,\"\",ROW())","v":15},"Unit 21 - A Technology Business",null,"Unit 21 - A Technology Business",{"$f":"IF(COUNTIF(Diploma!list1,GG15)>=1,\"\",ROW())","v":15},"Unit 21 - A Technology Business"]
["Unit 20 - Interactive Media Production Briefs",{"$f":"IF(COUNTIF(Diploma!list1,A16)>=1,\"\",ROW())","v":16},"Unit 20 - Interactive Media Production Briefs",null,null,null,null,null,null,null,null,null,null,null,null,null,null,null,null,null,null,null,null,null,{"$f":"COUNTIF(Diploma!$G$23:$G$31, \"Unit 17 - Community Volunteering in Health and Social Care\")","v":0},null,null,null,null,null,null,null,null,null,null,null,null,null,null,null,null,null,null,null,null,null,null,null,"Unit 24 - Lighting for Performance",16,"Unit 24 - Lighting for Performance",null,"Unit 23 - Realising Mask Design for Performance",{"$f":"IF(COUNTIF(Certificate!$G$23:$G$25,BA16)>=1,\"\",ROW())","v":16},"Unit 23 - Realising Mask Design for Performance",null,null,null,null,null,null,null,null,null,null,null,null,null,null,null,null,null,null,null,null,null,null,null,null,null,null,null,null,null,null,null,null,null,null,null,null,null,"Unit 39 - Work Experience in the Performing Arts",{"$f":"IF(COUNTIF(Diploma!list1,CO16)>=1,\"\",ROW())","v":16},"Unit 39 - Work Experience in the Performing Arts",null,null,null,null,null,null,null,null,null,null,null,null,null,null,null,null,null,null,null,null,null,null,null,null,null,null,null,null,null,"Unit 30 - Ceramics",{"$f":"IF(COUNTIF(Diploma!list1,DU16)>=1,\"\",ROW())","v":16},"Unit 30 - Ceramics",null,null,null,null,null,"Unit 39 - Modelmaking",{"$f":"IF(COUNTIF(Diploma!list1,EC16)>=1,\"\",ROW())","v":16},"Unit 39 - Modelmaking",null,null,null,null,null,null,null,null,null,"Unit 27 - Enterprise and Music",16,"Unit 27 - Enterprise and Music",null,"Unit 23 - Further Chemistry ",{"$f":"IF(COUNTIF('Extended Certificate'!$G$21:$G$29,ES16)>=1,\"\",ROW())","v":16},"Unit 23 - Further Chemistry ",null,null,null,null,null,null,null,null,null,null,null,null,null,null,null,null,null,null,null,null,null,"Unit 27 - Operation and Maintenance of Fluid Power Systems \nand Components",16,"Unit 27 - Operation and Maintenance of Fluid Power Systems \nand Components",null,null,null,null,null,null,null,null,null,"Unit 23 - Computer Systems Support in Practice",{"$f":"IF(COUNTIF(Diploma!list1,GC16)>=1,\"\",ROW())","v":16},"Unit 23 - Computer Systems Support in Practice",null,"Unit 23 - Computer Systems Support in Practice",{"$f":"IF(COUNTIF(Diploma!list1,GG16)>=1,\"\",ROW())","v":16},"Unit 23 - Computer Systems Support in Practice"]
[{"$f":"IF(A39=1,\"\",\"Unit 21 - Painting Briefs\")","v":"Unit 21 - Painting Briefs"},{"$f":"IF(COUNTIF(Diploma!list1,A17)>=1,\"\",ROW())","v":17},"Unit 21 - Painting Briefs",null,null,null,null,null,null,null,null,null,null,null,null,null,null,null,null,null,null,null,null,null,null,null,null,null,null,null,null,null,null,null,null,null,null,null,null,null,null,null,null,null,null,null,null,null,"Unit 25 - Sound for Performance",17,"Unit 25 - Sound for Performance",null,"Unit 24 - Lighting for Performance",{"$f":"IF(COUNTIF(Certificate!$G$23:$G$25,BA17)>=1,\"\",ROW())","v":17},"Unit 24 - Lighting for Performance",null,null,null,null,null,null,null,null,null,null,null,null,null,null,null,null,null,null,null,null,null,null,null,null,null,null,null,null,null,null,null,null,null,null,null,null,null,null,null,null,null,null,null,null,null,null,null,null,null,null,null,null,null,null,null,null,null,null,null,null,null,null,null,null,null,null,null,null,null,"Unit 37 - Sustainability in Art and Design Practice",{"$f":"IF(COUNTIF(Diploma!list1,DU17)>=1,\"\",ROW())","v":17},"Unit 37 - Sustainability in Art and Design Practice",null,null,null,null,null,null,null,null,null,null,null,null,null,"Unit 20",null,null,null,null,null,null,null,"Unit 24 - Further Physics",{"$f":"IF(COUNTIF('Extended Certificate'!$G$21:$G$29,ES17)>=1,\"\",ROW())","v":17},{"$f":"IF(ROW(ES17)-ROW(ES$2)+1>COUNT(ET$2:ET$17),\"\",INDEX(ES:ES,SMALL(ET$2:ET$17,1+ROW(ES17)-ROW(ES$2))))","v":"Unit 24 - Further Physics"},null,null,null,null,null,null,null,null,null,null,null,null,null,null,null,null,null,null,null,null,null,"Unit 28 - Fabrication Techniques",17,"Unit 28 - Fabrication Techniques",null,null,null,null,null,null,null,null,null,"Unit 25 - IT Work Experience",{"$f":"IF(COUNTIF(Diploma!list1,GC17)>=1,\"\",ROW())","v":17},"Unit 25 - IT Work Experience",null,"Unit 25 - IT Work Experience",{"$f":"IF(COUNTIF(Diploma!list1,GG17)>=1,\"\",ROW())","v":17},{"$f":"IF(ROW(GG17)-ROW(GG$2)+1>COUNT(GH$2:GH$17),\"\",INDEX(GG:GG,SMALL(GH$2:GH$17,1+ROW(GG17)-ROW(GG$2))))","v":"Unit 25 - IT Work Experience"}]
[{"$f":"IF(A48=1,\"\",\"Unit 22 - Designing Products\")","v":"Unit 22 - Designing Products"},{"$f":"IF(COUNTIF(Diploma!list1,A18)>=1,\"\",ROW())","v":18},"Unit 22 - Designing Products",null,null,null,"Unit 8",null,null,null,null,null,null,null,null,null,null,null,null,null,null,null,null,null,null,null,null,null,null,null,null,null,null,null,null,null,null,null,null,null,null,null,null,null,null,null,null,null,"Unit 26 - Supporting Performance: Stage Management",18,"Unit 26 - Supporting Performance: Stage Management",null,"Unit 25 - Sound for Performance",{"$f":"IF(COUNTIF(Certificate!$G$23:$G$25,BA18)>=1,\"\",ROW())","v":18},"Unit 25 - Sound for Performance",null,null,null,null,null,null,null,null,null,null,null,null,null,null,null,null,null,null,null,null,null,null,null,null,null,null,null,null,null,null,null,null,null,null,null,null,null,null,null,null,null,null,null,null,null,null,null,null,null,null,null,null,null,null,null,null,null,null,null,null,null,null,null,null,null,null,null,null,null,"Unit 39 - Modelmaking",{"$f":"IF(COUNTIF(Diploma!list1,DU18)>=1,\"\",ROW())","v":18},"Unit 39 - Modelmaking",null,null,null,null,null,null,null,null,null,null,null,null,null,{"$f":"COUNTIF(Diploma!$G$33:$G$40, \"Unit 20 - Work Experience in Hospitality\")","v":0},null,null,null,null,null,null,null,null,null,null,null,null,null,null,null,null,null,null,null,null,null,null,null,null,null,null,null,null,null,null,null,"Unit 29 - Casting Techniques",18,"Unit 29 - Casting Techniques"]
["Unit 24 - Design Thinking",{"$f":"IF(COUNTIF(Diploma!list1,A19)>=1,\"\",ROW())","v":19},"Unit 24 - Design Thinking",null,null,null,{"$f":"COUNTIF(Diploma!$G$33:$G$40, \"Unit 8 - Recruitment, Selection and Employment\")","v":0},null,null,null,null,null,"Unit 6",null,"Unit 16","Forbidden?",null,null,null,null,null,null,null,null,null,null," ",null,null,null,null,null,null,null,null,null,null,null,null,null,null,null,null,null,null,null,null,null,"Unit 27 - Supporting Performance: Front of House",19,"Unit 27 - Supporting Performance: Front of House",null,"Unit 26 - Supporting Performance: Stage Management",{"$f":"IF(COUNTIF(Certificate!$G$23:$G$25,BA19)>=1,\"\",ROW())","v":19},"Unit 26 - Supporting Performance: Stage Management",null,null,null,null,null,null,null,null,null,null,null,null,null,null,null,null,null,null,null,null,null,null,null,null,null,null,null,null,null,null,null,null,null,null,null,null,null,null,null,null,null,null,null,null,null,null,null,null,null,null,null,null,null,null,null,null,null,null,null,null,null,null,null,null,null,null,null,null,null,null,null,null,null,null,null,null,null,null,null,null,null,null,null,null,null,null,null,null,null,null,null,null,null,"Done",null,null,null,null,null,null,null,null,null,null,null,null,null,null,null,null,null,null,null,null,null,null,null,"Unit 30 - Vehicle Maintenance Techniques",19,"Unit 30 - Vehicle Maintenance Techniques",null,null,null,null,null,null,null,null,null,null,null,null,null,null,null,null,null,"Unit 10"]
["Unit 25 - Fashion Promotion",{"$f":"IF(COUNTIF(Diploma!list1,A20)>=1,\"\",ROW())","v":20},"Unit 25 - Fashion Promotion",null,null,null,null,null,null,null,null,null,{"$f":"COUNTIF(Diploma!$G$33:$G$40, \"Unit 6 - Exploring Carpentry and Joinery Principles and Techniques\")","v":0},null,{"$f":"COUNTIF(Diploma!$G$23:$G$31, \"Unit 16 - Carpentry and Joinery Operations\")","v":0},{"$f":"IF(AND(M20=0,O20=1),1,0)","v":0},null,null,null,null,null,null,null,null,null,null,null,null,null,null,null,null,null,null,null,null,null,null,null,null,null,null,null,null,null,null,null,null,"Unit 28 - Make-up for Performance",20,"Unit 28 - Make-up for Performance",null,"Unit 27 - Supporting Performance: Front of House",{"$f":"IF(COUNTIF(Certificate!$G$23:$G$25,BA20)>=1,\"\",ROW())","v":20},"Unit 27 - Supporting Performance: Front of House",null,null,null,null,null,null,null,null,null,null,null,null,null,null,null,null,null,null,null,null,null,null,null,null,null,null,null,null,null,null,null,null,null,null,null,null,null,null,null,null,null,null,null,null,null,null,null,null,null,null,null,null,null,null,null,null,null,null,null,null,null,null,null,null,null,null,null,null,null,"Unit 3",null,"Unit 11",null,null,null,null,null,null,null,null,null,null,null,null,null,"Unit 21",null,null,null,null,null,null,null,null,null,null,null,null,null,null,null,null,null,null,null,{"$f":"IF(OR(P20=1,P23=1,P26=1,P29=1,P32=1),\"\",\"1\")","v":"1"},null,null,null,null,null,null,null,null,null,null,null,"Unit 31 - Production Planning for Engineering",20,"Unit 31 - Production Planning for Engineering",null,null,null,null,null,null,null,null,null,null,null,null,null,null,null,null,null,{"$f":"COUNTIF(Diploma!$G$33:$G$40, \"Unit 10 - Adventurous Activities in the Public Services\")","v":0}]
["Unit 26 - Moving Image Briefs",{"$f":"IF(COUNTIF(Diploma!list1,A21)>=1,\"\",ROW())","v":21},"Unit 26 - Moving Image Briefs",null,null,null,"Unit 24",null,null,null,null,null,null,null,null,null,null,null,null,null,null,null,null,null,null,null,null,null,null,null,null,null,null,null,null,null,null,null,null,null,null,null,null,null,null,null,null,null,"Unit 29 - Wardrobe for Stage Performance",21,"Unit 29 - Wardrobe for Stage Performance",null,"Unit 28 - Make-up for Performance",{"$f":"IF(COUNTIF(Certificate!$G$23:$G$25,BA21)>=1,\"\",ROW())","v":21},"Unit 28 - Make-up for Performance",null,null,null,null,null,null,null,null,null,null,null,null,null,null,null,null,null,null,null,null,null,null,null,null,null,null,null,null,null,null,null,null,null,null,null,null,null,null,null,null,null,null,null,null,null,null,null,null,null,null,null,null,null,null,null,null,null,null,null,null,null,null,null,null,null,null,null,null,null,{"$f":"COUNTIF(Diploma!$G$23:$G$31, \"Unit 3 - Communicating Ideas in 2D\")","v":0},null,{"$f":"COUNTIF(Diploma!$G$23:$G$31, \"Unit 11 - Graphic Design Briefs\")","v":0},null,null,null,null,null,null,null,null,null,null,null,null,null,{"$f":"COUNTIF(Diploma!$G$33:$G$40, \"Unit 21 - Hospitality Community Volunteering\")","v":0},null,null,null,null,null,null,null,null,null,null,null,null,null,null,null,null,null,null,null,null,null,null,null,null,null,null,null,null,null,null,null,"Unit 32 - Engineering Marking Out",21,"Unit 32 - Engineering Marking Out"]
["Unit 27 - Interaction Design",{"$f":"IF(COUNTIF(Diploma!list1,A22)>=1,\"\",ROW())","v":22},"Unit 27 - Interaction Design",null,null,null,{"$f":"COUNTIF(Diploma!$G$23:$G$31, \"Unit 24 - Work Experience in Business\")","v":0},null,null,null,null,null,"Unit 7",null,"Unit 17",null,null,null,null,null,null,null,null,null,null,null,null,null,null,null,null,null,null,null,null,null,null,null,null,null,null,null,null,null,null,null,null,null,"Unit 30 - Choreographing Dance",22,"Unit 30 - Choreographing Dance",null,"Unit 29 - Wardrobe for Stage Performance",{"$f":"IF(COUNTIF(Certificate!$G$23:$G$25,BA22)>=1,\"\",ROW())","v":22},"Unit 29 - Wardrobe for Stage Performance",null,null,null,null,null,null,null,null,null,null,null,null,null,null,null,null,null,null,null,null,null,null,null,null,null,null,null,null,null,null,null,null,null,null,null,null,null,null,null,null,null,null,null,null,null,null,null,null,null,null,null,null,null,null,null,null,null,null,null,null,null,null,null,null,null,null,null,null,null,null,null,null,null,null,null,null,null,null,null,null,null,null,null,null,null,null,null,null,null,null,null,null,null,null,null,null,null,null,null,null,null,null,null,null,null,null,null,null,null,null,null,null,null,null,null,null,null,"Unit 33 - Preparing and Controlling Engineering Manufacturing \nOperations",22,"Unit 33 - Preparing and Controlling Engineering Manufacturing \nOperations",null,null,null,null,null,null,null,null,null,null,null,null,null,null,null,null,null,"Unit 14"]
["Unit 28 - Printmaking Briefs",{"$f":"IF(COUNTIF(Diploma!list1,A23)>=1,\"\",ROW())","v":23},"Unit 28 - Printmaking Briefs",null,null,null,null,null,null,null,null,null,{"$f":"COUNTIF(Diploma!$G$33:$G$40, \"Unit 7 - Exploring Brickwork and Blockwork Principles and Techniques\")","v":0},null,{"$f":"COUNTIF(Diploma!$G$23:$G$31, \"Unit 17 - Brickwork and Blockwork Operations\")","v":0},{"$f":"IF(AND(M23=0,O23=1),1,0)","v":0},null,null,null,null,null,null,null,null,null,null,null,null,null,null,null,null,null,null,null,null,null,null,null,null,null,null,null,null,null,null,null,null,"Unit 32 - Directing Performance",23,"Unit 32 - Directing Performance",null,null,null,null,null,null,null,null,null,null,null,null,null,null,null,null,null,null,null,null,null,null,null,null,null,null,null,null,null,null,null,null,null,null,null,null,null,null,null,null,null,null,null,null,null,null,null,null,null,null,null,null,null,null,null,null,null,null,null,null,null,null,null,null,null,null,null,null,null,null,null,null,null,"Unit 4",null,"Unit 18",null,null,null,null,null,null,null,null,null,null,null,null,null,null,null,null,null,null,null,null,null,null,null,null,null,null,null,null,null,null,null,null,null,null,null,null,null,null,null,null,null,null,null,null,null,"Unit 34 - PC Software and Hardware in Engineering",23,"Unit 34 - PC Software and Hardware in Engineering",null,null,null,null,null,null,null,null,null,null,null,null,null,null,null,null,null,{"$f":"COUNTIF(Diploma!$G$23:$G$31, \"Unit 14 - Multi-day Expedition Experience\")","v":0}]
["Unit 29 - Drawing from Observation",{"$f":"IF(COUNTIF(Diploma!list1,A24)>=1,\"\",ROW())","v":24},"Unit 29 - Drawing from Observation",null,null,null,null,null,null,null,null,null,null,null,null,null,null,null,null,null,null,null,null,null,null,null,null,null,null,null,null,null,null,null,null,null,null,null,null,null,null,null,null,null,null,null,null,null,"Unit 33 - Planning and Managing a Performing Arts Event",24,"Unit 33 - Planning and Managing a Performing Arts Event",null,null,null,null,null,null,null,null,null,null,null,null,null,null,null,null,null,null,null,null,null,null,null,null,null,null,null,null,null,null,null,null,null,null,null,null,null,null,null,null,null,null,null,null,null,null,null,null,null,null,null,null,null,null,null,null,null,null,null,null,null,null,null,null,null,null,null,null,null,null,null,null,null,{"$f":"COUNTIF(Diploma!$G$23:$G$31, \"Unit 4 - Communicating Ideas in 3D\")","v":0},null,{"$f":"COUNTIF(Diploma!$G$23:$G$31, \"Unit 18 - 3D Design Briefs\")","v":0},null,null,null,null,null,null,null,null,null,null,null,null,null,null,null,null,null,null,null,null,null,null,null,null,null,null,null,null,null,null,null,null,null,null,null,null,null,null,null,null,null,null,null,null,null,"Unit 35 - Application of Quality Control and Measurement in \nEngineering",24,"Unit 35 - Application of Quality Control and Measurement in \nEngineering"]
["Unit 30 - Ceramics",{"$f":"IF(COUNTIF(Diploma!list1,A25)>=1,\"\",ROW())","v":25},"Unit 30 - Ceramics",null,null,null,null,null,null,null,null,null,"Unit 8",null,"Unit 18",null,null,null,null,null,null,null,null,null,null,null,null,null,null,null,null,null,null,null,null,null,null,null,null,null,null,null,null,null,null,null,null,null,"Unit 34 - Multimedia Production",25,"Unit 34 - Multimedia Production"]
["Unit 31 - Studio Photography",{"$f":"IF(COUNTIF(Diploma!list1,A26)>=1,\"\",ROW())","v":26},"Unit 31 - Studio Photography",null,null,null,null,null,null,null,null,null,{"$f":"COUNTIF(Diploma!$G$33:$G$40, \"Unit 8 - Exploring Painting and Decorating Principles and Techniques\")","v":0},null,{"$f":"COUNTIF(Diploma!$G$23:$G$31, \"Unit 18 - Painting and Paperhanging Operations\")","v":0},{"$f":"IF(AND(M26=0,O26=1),1,0)","v":0},null,null,null,null,null,null,null,null,null,null,null,null,null,null,null,null,null,null,null,null,null,null,null,null,null,null,null,null,null,null,null,null,"Unit 35 - Physical Theatre Performance",26,"Unit 35 - Physical Theatre Performance",null,null,null,null,null,null,null,null,null,null,null,null,null,null,null,null,null,null,null,null,null,null,null,null,null,null,null,null,null,null,null,null,null,null,null,null,null,null,null,null,null,null,null,null,null,null,null,null,null,null,null,null,null,null,null,null,null,null,null,null,null,null,null,null,null,null,null,null,null,null,null,null,null,null,null,"Unit 22"]
["Unit 32 - Location Photography",{"$f":"IF(COUNTIF(Diploma!list1,A27)>=1,\"\",ROW())","v":27},"Unit 32 - Location Photography",null,null,null,null,null,null,null,null,null,null,null,null,null,null,null,null,null,null,null,null,null," ",null,null,null,null,null,null,null,null,null,null,null,null,null,null,null,null,null,null,null,null,null,null,null,"Unit 36 - Variety Performance",27,"Unit 36 - Variety Performance",null,null,null,null,null,null,null,null,null,null,null,null,null,null,null,null,null,null,null,null,null,null,null,null,null,null,null,null,null,null,null,null,null,null,null,null,null,null,null,null,null,null,null,null,null,null,null,null,null,null,null,null,null,null,null,null,null,null,null,null,null,null,null,null,null,null,null,null,null,null,null,null,null,null,null,{"$f":"COUNTIF(Diploma!$G$23:$G$31, \"Unit 22 - Designing Products\")","v":0}]
["Unit 33 - Designing for Print and Screen",{"$f":"IF(COUNTIF(Diploma!list1,A28)>=1,\"\",ROW())","v":28},"Unit 33 - Designing for Print and Screen",null,null,null,null,null,null,null,null,null,"Unit 9",null,"Unit 19",null,null,null,null,null,null,null,null,null,null,null,null,null,null,null,null,null,null,null,null,null,null,null,null,null,null,null,null,null,null,null,null,null,"Unit 38 - Use of ICT in the Performing Arts",28,"Unit 38 - Use of ICT in the Performing Arts"]
["Unit 34 - Editing Photographic Images",{"$f":"IF(COUNTIF(Diploma!list1,A29)>=1,\"\",ROW())","v":29},"Unit 34 - Editing Photographic Images",null,null,null,null,null,null,null,null,null,{"$f":"COUNTIF(Diploma!$G$33:$G$40, \"Unit 9 - Exploring Plumbing Principles and Techniques\")","v":0},null,{"$f":"COUNTIF(Diploma!$G$33:$G$40, \"Unit 19 - Plumbing Operations\")","v":0},0,null,null,null,null,null,null,null,null,null,null,null,null,null,null,null,null,null,null,null,null,null,null,null,null,null,null,null,null,null,null,null,null,"Unit 39 - Work Experience in the Performing Arts",29,"Unit 39 - Work Experience in the Performing Arts"]
["Unit 35 - Fashion Retail",{"$f":"IF(COUNTIF(Diploma!list1,A30)>=1,\"\",ROW())","v":30},"Unit 35 - Fashion Retail",null,null,null,null,null,null,null,null,null,null,null,null,null,null,null,null,null,null,null,null,null,null,null,null,null,null,null,null,null,null,null,null,null,null,null,null,null,null,null,null,null,null,null,null,null,"Unit 40 - Singing Skills in the Performing Arts",30,"Unit 40 - Singing Skills in the Performing Arts"]
["Unit 36 - Surface Design",{"$f":"IF(COUNTIF(Diploma!list1,A31)>=1,\"\",ROW())","v":31},"Unit 36 - Surface Design",null,null,null,null,null,null,null,null,null,"Unit 10",null,"Unit 20"]
["Unit 37 - Sustainability in Art and Design Practice",{"$f":"IF(COUNTIF(Diploma!list1,A32)>=1,\"\",ROW())","v":32},"Unit 37 - Sustainability in Art and Design Practice",null,null,null,null,null,null,null,null,null,{"$f":"COUNTIF(Diploma!$G$33:$G$40, \"Unit 10 - Exploring Electrical Principles and Techniques\")","v":0},null,{"$f":"COUNTIF(Diploma!$G$33:$G$40, \"Unit 20 - Electrical Operations\")","v":0},0]
["Unit 38 - Advertising Briefs",{"$f":"IF(COUNTIF(Diploma!list1,A33)>=1,\"\",ROW())","v":33},"Unit 38 - Advertising Briefs"]
["Unit 39 - Modelmaking",{"$f":"IF(COUNTIF(Diploma!list1,A34)>=1,\"\",ROW())","v":34},"Unit 39 - Modelmaking"]
[{"$f":"IF(A48=1,\"\",\"Unit 40 - Sculpture\")","v":"Unit 40 - Sculpture"},{"$f":"IF(COUNTIF(Diploma!list1,A35)>=1,\"\",ROW())","v":35},"Unit 40 - Sculpture"]
[]
[]
["Unit 3",null,"Unit 11"]
[{"$f":"COUNTIF(Diploma!$G$23:$G$31, \"Unit 3 - Communicating Ideas in 2D\")","v":0},null,{"$f":"COUNTIF(Diploma!$G$23:$G$31, \"Unit 11 - Graphic Design Briefs\")","v":0}]
[]
[null,null,"Unit 13"]
[null,null,{"$f":"COUNTIF(Diploma!$G$23:$G$31, \"Unit 13 - Visual Arts Briefs\")","v":0}]
[]
[null,null,"Unit 21"]
[null,null,{"$f":"COUNTIF(Diploma!$G$23:$G$31, \"Unit 21 - Painting Briefs\")","v":0}]
[]
["Unit 4",null,"Unit 9"]
[{"$f":"COUNTIF(Diploma!$G$23:$G$31, \"Unit 4 - Communicating Ideas in 3D\")","v":0},null,{"$f":"COUNTIF(Diploma!$G$23:$G$31, \"Unit 9 - Design Crafts Briefs\")","v":0}]
[]
[null,null,"Unit 18"]
[null,null,{"$f":"COUNTIF(Diploma!$G$23:$G$31, \"Unit 18 - 3D Design Briefs\")","v":0}]
[]
[null,null,"Unit 22"]
[null,null,{"$f":"COUNTIF(Diploma!$G$23:$G$31, \"Unit 22 - Designing Products\")","v":0}]
[]
[null,null,"Unit 40"]
[null,null,{"$f":"COUNTIF(Diploma!$G$23:$G$31, \"Unit 40 - Sculpture\")","v":0}]

{"sheet":"Ext Cert Validation","index":12,"n_rows":44,"n_cols":155,"rows_kept":44,"cut":false,"hidden":true,"merged":[]}
["Art and Design",null,null,null,"Business",null,null,null,"CPLD",null,null,null,"Construction",null,null,null,"CDMP",null,null,null,"Engineering",null,null,null,"H&SC",null,null,null,"Hospitality A",null,null,null,"ICT Mand",null,null,null,"ICT Opt",null,null,null,"Music A",null,null,null,"Performing Arts",null,null,null,"Group B",null,null,null,null,null,null,null,"Performing Arts (Acting)",null,null,null,"Group B",null,null,null,"Group C",null,null,null,"Group B",null,null,null,"Performing Arts (Dance)",null,null,null,"Group B",null,null,null,"Group C",null,null,null,"Performing Arts (Musical Theatre)",null,null,null,"Group B",null,null,null,"Performing Arts (Production)",null,null,null,"Group B",null,null,null,"Sport",null,null,null,"Travel and Tourism",null,null,null,"CDMP Optional B",null,null,null,"A&D Design Crafts",null,null,null,"A&D Fashion & Textiles",null,null,null,"A&D Photography",null,null,null,"A&D Product Design",null,null,null,"A&D Visual Arts",null,null,null,"A&D Visual Communication",null,null,null,"No Optional Group B",null,null,null,"Hospitality B",null,null,null,"Music B",null,null,null,"Applied Science",null,null,null,"Public Services"]
[{"$f":"IF(OR(A32=1,A35=1,A41=1),\"\",\"Unit 3 - Communicating Ideas in 2D\")","v":"Unit 3 - Communicating Ideas in 2D"},{"$f":"IF(COUNTIF('Extended Certificate'!$G$21:$G$29,A2)>=1,\"\",ROW())","v":2},{"$f":"IF(ROW(A2)-ROW(A$2)+1>COUNT(B$2:B$19),\"\",INDEX(A:A,SMALL(B$2:B$19,1+ROW(A2)-ROW(A$2))))","v":"Unit 3 - Communicating Ideas in 2D"},null,{"$f":"IF(AND(E23=0,E26=1),\"\",\"Unit 3 - Promoting a Brand\")","v":"Unit 3 - Promoting a Brand"},{"$f":"IF(COUNTIF('Extended Certificate'!$G$21:$G$29,E2)>=1,\"\",ROW())","v":2},{"$f":"IF(ROW(E2)-ROW(E$2)+1>COUNT(F$2:F$15),\"\",INDEX(E:E,SMALL(F$2:F$15,1+ROW(E2)-ROW(E$2))))","v":"Unit 3 - Promoting a Brand"},null,"Unit 5 - Health and Safety in Early Years Settings",{"$f":"IF(COUNTIF(Certificate!$G$17:$G$21,I2)>=1,\"\",ROW())","v":2},{"$f":"IF(ROW(I2)-ROW(I$2)+1>COUNT(J$2:J$5),\"\",INDEX(I:I,SMALL(J$2:J$5,1+ROW(I2)-ROW(I$2))))","v":"Unit 5 - Health and Safety in Early Years Settings"},null,{"$f":"IF(OR(P20=1,P23=1,P26=1,P29=1,P32=1),\"\",\"Unit 4 - Construction Processes and Operations\")","v":"Unit 4 - Construction Processes and Operations"},{"$f":"IF(COUNTIF('Extended Certificate'!$G$21:$G$29,M2)>=1,\"\",ROW())","v":2},{"$f":"IF(ROW(M2)-ROW(M$2)+1>COUNT(N$2:N$17),\"\",INDEX(M:M,SMALL(N$2:N$17,1+ROW(M2)-ROW(M$2))))","v":"Unit 4 - Construction Processes and Operations"},null,"Unit 3 - Digital Moving Image Production",{"$f":"IF(COUNTIF('Extended Certificate'!$G$21:$G$29,Q2)>=1,\"\",ROW())","v":2},{"$f":"IF(ROW(Q2)-ROW(Q$2)+1>COUNT(R$2:R$6),\"\",INDEX(Q:Q,SMALL(R$2:R$6,1+ROW(Q2)-ROW(Q$2))))","v":"Unit 3 - Digital Moving Image Production"},null,"Unit 3 - Health and Safety in Engineering",{"$f":"IF(COUNTIF('Extended Certificate'!$G$21:$G$29,U2)>=1,\"\",ROW())","v":2},{"$f":"IF(ROW(U2)-ROW(U$2)+1>COUNT(V$2:V$17),\"\",INDEX(U:U,SMALL(V$2:V$17,1+ROW(U2)-ROW(U$2))))","v":"Unit 3 - Health and Safety in Engineering"},null,"Unit 4 - Social Influences on Health and Wellbeing",{"$f":"IF(COUNTIF('Extended Certificate'!$G$21:$G$29,Y2)>=1,\"\",ROW())","v":2},{"$f":"IF(ROW(Y2)-ROW(Y$2)+1>COUNT(Z$2:Z$11),\"\",INDEX(Y:Y,SMALL(Z$2:Z$11,1+ROW(Y2)-ROW(Y$2))))","v":"Unit 4 - Social Influences on Health and Wellbeing"},null,{"$f":"IF(AND(AF17=1,AF14=0),\"\",\"Unit 4 - Costing and Controlling Finances in the Hospitality Industry\")","v":"Unit 4 - Costing and Controlling Finances in the Hospitality Industry"},{"$f":"IF(COUNTIF('Extended Certificate'!$G$21:$G$29,AC2)>=1,\"\",ROW())","v":2},{"$f":"IF(ROW(AC2)-ROW(AC$2)+1>COUNT(AD$2:AD$6),\"\",INDEX(AC:AC,SMALL(AD$2:AD$6,1+ROW(AC2)-ROW(AC$2))))","v":"Unit 4 - Costing and Controlling Finances in the Hospitality Industry"},null,"Unit 1 - The Online World",{"$f":"IF(COUNTIF(Certificate!$G$17:$G$21,AG2)>=1,\"\",ROW())","v":2},{"$f":"IF(ROW(AG2)-ROW(AG$2)+1>COUNT(AH$2:AH$3),\"\",INDEX(AG:AG,SMALL(AH$2:AH$3,1+ROW(AG2)-ROW(AG$2))))","v":"Unit 1 - The Online World"},null,"Unit 4 - Creating Digital Animation",{"$f":"IF(COUNTIF('Extended Certificate'!$G$21:$G$29,AK2)>=1,\"\",ROW())","v":2},{"$f":"IF(ROW(AK2)-ROW(AK$2)+1>COUNT(AL$2:AL$15),\"\",INDEX(AK:AK,SMALL(AL$2:AL$15,1+ROW(AK2)-ROW(AK$2))))","v":"Unit 4 - Creating Digital Animation"},null,"Unit 3 - Introducing Live Sound",{"$f":"IF(COUNTIF('Extended Certificate'!$G$21:$G$29,AO2)>=1,\"\",ROW())","v":2},{"$f":"IF(ROW(AO2)-ROW(AO$2)+1>COUNT(AP$2:AP$8),\"\",INDEX(AO:AO,SMALL(AP$2:AP$8,1+ROW(AO2)-ROW(AO$2))))","v":"Unit 3 - Introducing Live Sound"},null,"Unit 3 - Acting Skills",{"$f":"IF(COUNTIF('Extended Certificate'!$G$21:$G$29,AS2)>=1,\"\",ROW())","v":2},{"$f":"IF(ROW(AS2)-ROW(AS$2)+1>COUNT(AT$2:AT$6),\"\",INDEX(AS:AS,SMALL(AT$2:AT$6,1+ROW(AS2)-ROW(AS$2))))","v":"Unit 3 - Acting Skills"},null,"Unit 9 - Performance in Context",{"$f":"IF(COUNTIF('Extended Certificate'!$G$31:$G$37,AW2)>=1,\"\",ROW())","v":2},{"$f":"IF(ROW(AW2)-ROW(AW$2)+1>COUNT(AX$2:AX$22),\"\",INDEX(AW:AW,SMALL(AX$2:AX$22,1+ROW(AW2)-ROW(AW$2))))","v":"Unit 9 - Performance in Context"},null,"Unit 9 - Performance in Context",{"$f":"IF(COUNTIF(Certificate!$G$23:$G$25,BA2)>=1,\"\",ROW())","v":2},{"$f":"IF(ROW(BA2)-ROW(BA$2)+1>COUNT(BB$2:BB$22),\"\",INDEX(BA:BA,SMALL(BB$2:BB$22,1+ROW(BA2)-ROW(BA$2))))","v":"Unit 9 - Performance in Context"},null,"Unit 9 - Performance in Context",{"$f":"IF(COUNTIF('Extended Certificate'!$G$21:$G$29,BE2)>=1,\"\",ROW())","v":2},{"$f":"IF(ROW(BE2)-ROW(BE$2)+1>COUNT(BF$2:BF$8),\"\",INDEX(BE:BE,SMALL(BF$2:BF$8,1+ROW(BE2)-ROW(BE$2))))","v":"Unit 9 - Performance in Context"},null,"Unit 16 - Contemporary Dance Techniques",{"$f":"IF(COUNTIF('Extended Certificate'!$G$31:$G$37,BI2)>=1,\"\",ROW())","v":2},{"$f":"IF(ROW(BI2)-ROW(BI$2)+1>COUNT(BJ$2:BJ$4),\"\",INDEX(BI:BI,SMALL(BJ$2:BJ$4,1+ROW(BI2)-ROW(BI$2))))","v":"Unit 16 - Contemporary Dance Techniques"},null,"Unit 19 - Design Planning for Performance",{"$f":"IF(COUNTIF('Extended Certificate'!$G$39,BM2)>=1,\"\",ROW())","v":2},{"$f":"IF(ROW(BM2)-ROW(BM$2)+1>COUNT(BN$2:BN$10),\"\",INDEX(BM:BM,SMALL(BN$2:BN$10,1+ROW(BM2)-ROW(BM$2))))","v":"Unit 19 - Design Planning for Performance"},null,"Only one optional unit from Group B permitted",{"$f":"IF(COUNTIF(Certificate!$G$23:$G$23,BQ2)>=1,\"\",ROW())","v":2},"Only one optional unit from Group B permitted",null,"Unit 9 - Performance in Context",{"$f":"IF(COUNTIF('Extended Certificate'!$G$21:$G$29,BU2)>=1,\"\",ROW())","v":2},{"$f":"IF(ROW(BU2)-ROW(BU$2)+1>COUNT(BV$2:BV$7),\"\",INDEX(BU:BU,SMALL(BV$2:BV$7,1+ROW(BU2)-ROW(BU$2))))","v":"Unit 9 - Performance in Context"},null,"Unit 14 - Voice and Speech for Performers",{"$f":"IF(COUNTIF('Extended Certificate'!$G$31:$G$37,BY2)>=1,\"\",ROW())","v":2},{"$f":"IF(ROW(BY2)-ROW(BY$2)+1>COUNT(BZ$2:BZ$3),\"\",INDEX(BY:BY,SMALL(BZ$2:BZ$3,1+ROW(BY2)-ROW(BY$2))))","v":"Unit 14 - Voice and Speech for Performers"},null,"Unit 19 - Design Planning for Performance",{"$f":"IF(COUNTIF('Extended Certificate'!$G$39,CC2)>=1,\"\",ROW())","v":2},{"$f":"IF(ROW(CC2)-ROW(CC$2)+1>COUNT(CD$2:CD$10),\"\",INDEX(CC:CC,SMALL(CD$2:CD$10,1+ROW(CC2)-ROW(CC$2))))","v":"Unit 19 - Design Planning for Performance"},null,"Unit 9 - Performance in Context",{"$f":"IF(COUNTIF('Extended Certificate'!$G$21:$G$29,CG2)>=1,\"\",ROW())","v":2},{"$f":"IF(ROW(CG2)-ROW(CG$2)+1>COUNT(CH$2:CH$6),\"\",INDEX(CG:CG,SMALL(CH$2:CH$6,1+ROW(CG2)-ROW(CG$2))))","v":"Unit 9 - Performance in Context"},null,"Unit 15 - Performing Scripted Plays",{"$f":"IF(COUNTIF(Certificate!$G$23:$G$25,CK2)>=1,\"\",ROW())","v":2},{"$f":"IF(ROW(CK2)-ROW(CK$2)+1>COUNT(CL$2:CL$14),\"\",INDEX(CK:CK,SMALL(CL$2:CL$14,1+ROW(CK2)-ROW(CK$2))))","v":"Unit 15 - Performing Scripted Plays"},null,"Unit 9 - Performance in Context",{"$f":"IF(COUNTIF('Extended Certificate'!$G$21:$G$29,CO2)>=1,\"\",ROW())","v":2},{"$f":"IF(ROW(CO2)-ROW(CO$2)+1>COUNT(CP$2:CP$11),\"\",INDEX(CO:CO,SMALL(CP$2:CP$11,1+ROW(CO2)-ROW(CO$2))))","v":"Unit 9 - Performance in Context"},null,"Unit 10 - Movement Skills",{"$f":"IF(COUNTIF('Extended Certificate'!$G$31:$G$37,CS2)>=1,\"\",ROW())","v":2},{"$f":"IF(ROW(CS2)-ROW(CS$2)+1>COUNT(CT$2:CT$10),\"\",INDEX(CS:CS,SMALL(CT$2:CT$10,1+ROW(CS2)-ROW(CS$2))))","v":"Unit 10 - Movement Skills"},null,"Unit 3 - The Mind and Sports Performance",{"$f":"IF(COUNTIF('Extended Certificate'!$G$21:$G$29,CW2)>=1,\"\",ROW())","v":2},{"$f":"IF(ROW(CW2)-ROW(CW$2)+1>COUNT(CX$2:CX$11),\"\",INDEX(CW:CW,SMALL(CX$2:CX$11,1+ROW(CW2)-ROW(CW$2))))","v":"Unit 3 - The Mind and Sports Performance"},null,"Unit 3 - The Development of Travel and Tourism in the UK",{"$f":"IF(COUNTIF('Extended Certificate'!$G$21:$G$29,DA2)>=1,\"\",ROW())","v":2},{"$f":"IF(ROW(DA2)-ROW(DA$2)+1>COUNT(DB$2:DB$12),\"\",INDEX(DA:DA,SMALL(DB$2:DB$12,1+ROW(DA2)-ROW(DA$2))))","v":"Unit 3 - The Development of Travel and Tourism in the UK"},null,"Unit 9 - Digital Editing for Moving Image",{"$f":"IF(COUNTIF('Extended Certificate'!$G$31:$G$37,DE2)>=1,\"\",ROW())","v":2},{"$f":"IF(ROW(DE2)-ROW(DE$2)+1>COUNT(DF$2:DF$11),\"\",INDEX(DE:DE,SMALL(DF$2:DF$11,1+ROW(DE2)-ROW(DE$2))))","v":"Unit 9 - Digital Editing for Moving Image"},null,{"$f":"IF(DI17=1,\"\",\"Unit 3 - Communicating Ideas in 2D\")","v":"Unit 3 - Communicating Ideas in 2D"},{"$f":"IF(COUNTIF('Extended Certificate'!$G$21:$G$29,DI2)>=1,\"\",ROW())","v":2},{"$f":"IF(ROW(DI2)-ROW(DI$2)+1>COUNT(DJ$2:DJ$9),\"\",INDEX(DI:DI,SMALL(DJ$2:DJ$9,1+ROW(DI2)-ROW(DI$2))))","v":"Unit 3 - Communicating Ideas in 2D"},null,"Unit 3 - Communicating Ideas in 2D",{"$f":"IF(COUNTIF('Extended Certificate'!$G$21:$G$29,DM2)>=1,\"\",ROW())","v":2},{"$f":"IF(ROW(DM2)-ROW(DM$2)+1>COUNT(DN$2:DN$9),\"\",INDEX(DM:DM,SMALL(DN$2:DN$9,1+ROW(DM2)-ROW(DM$2))))","v":"Unit 3 - Communicating Ideas in 2D"},null,"Unit 3 - Communicating Ideas in 2D",{"$f":"IF(COUNTIF('Extended Certificate'!$G$21:$G$29,DQ2)>=1,\"\",ROW())","v":2},{"$f":"IF(ROW(DQ2)-ROW(DQ$2)+1>COUNT(DR$2:DR$11),\"\",INDEX(DQ:DQ,SMALL(DR$2:DR$11,1+ROW(DQ2)-ROW(DQ$2))))","v":"Unit 3 - Communicating Ideas in 2D"},null,{"$f":"IF(DU18=1,\"\",\"Unit 3 - Communicating Ideas in 2D\")","v":"Unit 3 - Communicating Ideas in 2D"},{"$f":"IF(COUNTIF('Extended Certificate'!$G$21:$G$29,DU2)>=1,\"\",ROW())","v":2},{"$f":"IF(ROW(DU2)-ROW(DU$2)+1>COUNT(DV$2:DV$12),\"\",INDEX(DU:DU,SMALL(DV$2:DV$12,1+ROW(DU2)-ROW(DU$2))))","v":"Unit 3 - Communicating Ideas in 2D"},null,"Unit 5 - Developing an Art and Design Portfolio",{"$f":"IF(COUNTIF('Extended Certificate'!$G$21:$G$29,DY2)>=1,\"\",ROW())","v":2},{"$f":"IF(ROW(DY2)-ROW(DY$2)+1>COUNT(DZ$2:DZ$12),\"\",INDEX(DY:DY,SMALL(DZ$2:DZ$12,1+ROW(DY2)-ROW(DY$2))))","v":"Unit 5 - Developing an Art and Design Portfolio"},null,"Unit 4 - Communicating Ideas in 3D",{"$f":"IF(COUNTIF('Extended Certificate'!$G$21:$G$29,EC2)>=1,\"\",ROW())","v":2},{"$f":"IF(ROW(EC2)-ROW(EC$2)+1>COUNT(ED$2:ED$10),\"\",INDEX(EC:EC,SMALL(ED$2:ED$10,1+ROW(EC2)-ROW(EC$2))))","v":"Unit 4 - Communicating Ideas in 3D"},null,"N/A",{"$f":"IF(COUNTIF(Certificate!$G$17:$G$21,EG2)>=1,\"\",ROW())","v":2},"N/A",null,"Unit 5 - Enterprise in the Hospitality Industry",{"$f":"IF(COUNTIF('Extended Certificate'!$G$31:$G$37,EK2)>=1,\"\",ROW())","v":2},{"$f":"IF(ROW(EK2)-ROW(EK$2)+1>COUNT(EL$2:EL$8),\"\",INDEX(EK:EK,SMALL(EL$2:EL$8,1+ROW(EK2)-ROW(EK$2))))","v":"Unit 5 - Enterprise in the Hospitality Industry"},null,"Unit 11 - Developing Solo Music Performance",{"$f":"IF(COUNTIF('Extended Certificate'!$G$31:$G$37,EO2)>=1,\"\",ROW())","v":2},{"$f":"IF(ROW(EO2)-ROW(EO$2)+1>COUNT(EP$2:EP$12),\"\",INDEX(EO:EO,SMALL(EP$2:EP$12,1+ROW(EO2)-ROW(EO$2))))","v":"Unit 11 - Developing Solo Music Performance"},null,"Unit 9 - Practical Scientific Project ",{"$f":"IF(COUNTIF('Extended Certificate'!$G$21:$G$29,ES2)>=1,\"\",ROW())","v":2},{"$f":"IF(ROW(ES2)-ROW(ES$2)+1>COUNT(ET$2:ET$17),\"\",INDEX(ES:ES,SMALL(ET$2:ET$17,1+ROW(ES2)-ROW(ES$2))))","v":"Unit 9 - Practical Scientific Project "},null,"Unit 3 - Employment in the Public Services",{"$f":"IF(COUNTIF('Extended Certificate'!$G$21:$G$29,EW2)>=1,\"\",ROW())","v":2},{"$f":"IF(ROW(EW2)-ROW(EW$2)+1>COUNT(EX$2:EX$15),\"\",INDEX(EW:EW,SMALL(EX$2:EX$15,1+ROW(EW2)-ROW(EW$2))))","v":"Unit 3 - Employment in the Public Services"}]
[{"$f":"IF(OR(A29=1,A35=1,A38=1,A44=1),\"\",\"Unit 4 - Communicating Ideas in 3D\")","v":"Unit 4 - Communicating Ideas in 3D"},{"$f":"IF(COUNTIF('Extended Certificate'!$G$21:$G$29,A3)>=1,\"\",ROW())","v":3},{"$f":"IF(ROW(A3)-ROW(A$2)+1>COUNT(B$2:B$19),\"\",INDEX(A:A,SMALL(B$2:B$19,1+ROW(A3)-ROW(A$2))))","v":"Unit 4 - Communicating Ideas in 3D"},null,"Unit 4 - Principles of Customer Service",{"$f":"IF(COUNTIF('Extended Certificate'!$G$21:$G$29,E3)>=1,\"\",ROW())","v":3},{"$f":"IF(ROW(E3)-ROW(E$2)+1>COUNT(F$2:F$15),\"\",INDEX(E:E,SMALL(F$2:F$15,1+ROW(E3)-ROW(E$2))))","v":"Unit 4 - Principles of Customer Service"},null,"Unit 6 - Supporting Children’s Language and Literacy Development",{"$f":"IF(COUNTIF(Certificate!$G$17:$G$21,I3)>=1,\"\",ROW())","v":3},{"$f":"IF(ROW(I3)-ROW(I$2)+1>COUNT(J$2:J$5),\"\",INDEX(I:I,SMALL(J$2:J$5,1+ROW(I3)-ROW(I$2))))","v":"Unit 6 - Supporting Children’s Language and Literacy Development"},null,{"$f":"IF(OR(P20=1,P23=1,P26=1,P29=1,P32=1),\"\",\"Unit 5 - Construction Drawing Techniques\")","v":"Unit 5 - Construction Drawing Techniques"},{"$f":"IF(COUNTIF('Extended Certificate'!$G$21:$G$29,M3)>=1,\"\",ROW())","v":3},{"$f":"IF(ROW(M3)-ROW(M$2)+1>COUNT(N$2:N$17),\"\",INDEX(M:M,SMALL(N$2:N$17,1+ROW(M3)-ROW(M$2))))","v":"Unit 5 - Construction Drawing Techniques"},null,"Unit 4 - Digital Audio Production",{"$f":"IF(COUNTIF('Extended Certificate'!$G$21:$G$29,Q3)>=1,\"\",ROW())","v":3},{"$f":"IF(ROW(Q3)-ROW(Q$2)+1>COUNT(R$2:R$6),\"\",INDEX(Q:Q,SMALL(R$2:R$6,1+ROW(Q3)-ROW(Q$2))))","v":"Unit 4 - Digital Audio Production"},null,"Unit 4 - Engineering Maintenance",{"$f":"IF(COUNTIF('Extended Certificate'!$G$21:$G$29,U3)>=1,\"\",ROW())","v":3},{"$f":"IF(ROW(U3)-ROW(U$2)+1>COUNT(V$2:V$17),\"\",INDEX(U:U,SMALL(V$2:V$17,1+ROW(U3)-ROW(U$2))))","v":"Unit 4 - Engineering Maintenance"},null,"Unit 5 - Promoting Health and Wellbeing",{"$f":"IF(COUNTIF('Extended Certificate'!$G$21:$G$29,Y3)>=1,\"\",ROW())","v":3},{"$f":"IF(ROW(Y3)-ROW(Y$2)+1>COUNT(Z$2:Z$11),\"\",INDEX(Y:Y,SMALL(Z$2:Z$11,1+ROW(Y3)-ROW(Y$2))))","v":"Unit 5 - Promoting Health and Wellbeing"},null,{"$f":"IF(AND(AF17=0,AF14=1),\"\",\"Unit 6 - Planning, Preparing, Cooking and Finishing Food\")","v":"Unit 6 - Planning, Preparing, Cooking and Finishing Food"},{"$f":"IF(COUNTIF('Extended Certificate'!$G$21:$G$29,AC3)>=1,\"\",ROW())","v":3},{"$f":"IF(ROW(AC3)-ROW(AC$2)+1>COUNT(AD$2:AD$6),\"\",INDEX(AC:AC,SMALL(AD$2:AD$6,1+ROW(AC3)-ROW(AC$2))))","v":"Unit 6 - Planning, Preparing, Cooking and Finishing Food"},null,"Unit 2 - Technology Systems",{"$f":"IF(COUNTIF(Certificate!$G$17:$G$21,AG3)>=1,\"\",ROW())","v":3},{"$f":"IF(ROW(AG3)-ROW(AG$2)+1>COUNT(AH$2:AH$3),\"\",INDEX(AG:AG,SMALL(AH$2:AH$3,1+ROW(AG3)-ROW(AG$2))))","v":"Unit 2 - Technology Systems"},null,"Unit 5 - Creating Digital Audio",{"$f":"IF(COUNTIF('Extended Certificate'!$G$21:$G$29,AK3)>=1,\"\",ROW())","v":3},{"$f":"IF(ROW(AK3)-ROW(AK$2)+1>COUNT(AL$2:AL$15),\"\",INDEX(AK:AK,SMALL(AL$2:AL$15,1+ROW(AK3)-ROW(AK$2))))","v":"Unit 5 - Creating Digital Audio"},null,"Unit 4 - Introducing Music Composition",{"$f":"IF(COUNTIF('Extended Certificate'!$G$21:$G$29,AO3)>=1,\"\",ROW())","v":3},{"$f":"IF(ROW(AO3)-ROW(AO$2)+1>COUNT(AP$2:AP$8),\"\",INDEX(AO:AO,SMALL(AP$2:AP$8,1+ROW(AO3)-ROW(AO$2))))","v":"Unit 4 - Introducing Music Composition"},null,"Unit 4 - Dance Skills",{"$f":"IF(COUNTIF('Extended Certificate'!$G$21:$G$29,AS3)>=1,\"\",ROW())","v":3},"Unit 4 - Dance Skills",null,"Unit 10 - Movement Skills",{"$f":"IF(COUNTIF('Extended Certificate'!$G$31:$G$37,AW3)>=1,\"\",ROW())","v":3},{"$f":"IF(ROW(AW3)-ROW(AW$2)+1>COUNT(AX$2:AX$22),\"\",INDEX(AW:AW,SMALL(AX$2:AX$22,1+ROW(AW3)-ROW(AW$2))))","v":"Unit 10 - Movement Skills"},null,"Unit 10 - Movement Skills",{"$f":"IF(COUNTIF(Certificate!$G$23:$G$25,BA3)>=1,\"\",ROW())","v":3},"Unit 10 - Movement Skills",null,"Unit 10 - Movement Skills",{"$f":"IF(COUNTIF('Extended Certificate'!$G$21:$G$29,BE3)>=1,\"\",ROW())","v":3},{"$f":"IF(ROW(BE3)-ROW(BE$2)+1>COUNT(BF$2:BF$8),\"\",INDEX(BE:BE,SMALL(BF$2:BF$8,1+ROW(BE3)-ROW(BE$2))))","v":"Unit 10 - Movement Skills"},null,"Unit 17 - Exploring Urban Dance Styles",{"$f":"IF(COUNTIF('Extended Certificate'!$G$31:$G$37,BI3)>=1,\"\",ROW())","v":3},{"$f":"IF(ROW(BI3)-ROW(BI$2)+1>COUNT(BJ$2:BJ$13),\"\",INDEX(BI:BI,SMALL(BJ$2:BJ$13,1+ROW(BI3)-ROW(BI$2))))","v":"Unit 17 - Exploring Urban Dance Styles"},null,"Unit 20 - Realising Costume Design for Performance",{"$f":"IF(COUNTIF('Extended Certificate'!$G$39,BM3)>=1,\"\",ROW())","v":3},"Unit 20 - Realising Costume Design for Performance",null,null,null,null,null,"Unit 10 - Movement Skills",{"$f":"IF(COUNTIF('Extended Certificate'!$G$21:$G$29,BU3)>=1,\"\",ROW())","v":3},"Unit 10 - Movement Skills",null,"Unit 15 - Performing Scripted Plays",{"$f":"IF(COUNTIF('Extended Certificate'!$G$31:$G$37,BY3)>=1,\"\",ROW())","v":3},{"$f":"IF(ROW(BY3)-ROW(BY$2)+1>COUNT(BZ$2:BZ$3),\"\",INDEX(BY:BY,SMALL(BZ$2:BZ$3,1+ROW(BY3)-ROW(BY$2))))","v":"Unit 15 - Performing Scripted Plays"},null,"Unit 20 - Realising Costume Design for Performance",{"$f":"IF(COUNTIF('Extended Certificate'!$G$39,CC3)>=1,\"\",ROW())","v":3},{"$f":"IF(ROW(CC3)-ROW(CC$2)+1>COUNT(CD$2:CD$10),\"\",INDEX(CC:CC,SMALL(CD$2:CD$10,1+ROW(CC3)-ROW(CC$2))))","v":"Unit 20 - Realising Costume Design for Performance"},null,"Unit 10 - Movement Skills",{"$f":"IF(COUNTIF('Extended Certificate'!$G$21:$G$29,CG3)>=1,\"\",ROW())","v":3},{"$f":"IF(ROW(CG3)-ROW(CG$2)+1>COUNT(CH$2:CH$6),\"\",INDEX(BE:BE,SMALL(CH$2:CH$6,1+ROW(CG3)-ROW(CG$2))))","v":"Unit 10 - Movement Skills"},null,"Unit 16 - Contemporary Dance Techniques",{"$f":"IF(COUNTIF(Certificate!$G$23:$G$25,CK3)>=1,\"\",ROW())","v":3},"Unit 16 - Contemporary Dance Techniques",null,"Unit 19 - Design Planning for Performance",{"$f":"IF(COUNTIF('Extended Certificate'!$G$21:$G$29,CO3)>=1,\"\",ROW())","v":3},"Unit 19 - Design Planning for Performance",null,"Unit 11 - Devising Performance Work",{"$f":"IF(COUNTIF('Extended Certificate'!$G$31:$G$37,CS3)>=1,\"\",ROW())","v":3},{"$f":"IF(ROW(CS3)-ROW(CS$2)+1>COUNT(CT$2:CT$10),\"\",INDEX(CS:CS,SMALL(CT$2:CT$10,1+ROW(CS3)-ROW(CS$2))))","v":"Unit 11 - Devising Performance Work"},null,"Unit 4 - The Sports Performer in Action",{"$f":"IF(COUNTIF('Extended Certificate'!$G$21:$G$29,CW3)>=1,\"\",ROW())","v":3},{"$f":"IF(ROW(CW3)-ROW(CW$2)+1>COUNT(CX$2:CX$11),\"\",INDEX(CW:CW,SMALL(CX$2:CX$11,1+ROW(CW3)-ROW(CW$2))))","v":"Unit 4 - The Sports Performer in Action"},null,"Unit 5 - Factors Affecting Worldwide Travel and Tourism",{"$f":"IF(COUNTIF('Extended Certificate'!$G$21:$G$29,DA3)>=1,\"\",ROW())","v":3},{"$f":"IF(ROW(DA3)-ROW(DA$2)+1>COUNT(DB$2:DB$12),\"\",INDEX(DA:DA,SMALL(DB$2:DB$12,1+ROW(DA3)-ROW(DA$2))))","v":"Unit 5 - Factors Affecting Worldwide Travel and Tourism"},null,"Unit 10 - Digital Photography for a Media Product",{"$f":"IF(COUNTIF('Extended Certificate'!$G$31:$G$37,DE3)>=1,\"\",ROW())","v":3},{"$f":"IF(ROW(DE3)-ROW(DE$2)+1>COUNT(DF$2:DF$11),\"\",INDEX(DE:DE,SMALL(DF$2:DF$11,1+ROW(DE3)-ROW(DE$2))))","v":"Unit 10 - Digital Photography for a Media Product"},null,"Unit 5 - Developing an Art and Design Portfolio",{"$f":"IF(COUNTIF('Extended Certificate'!$G$21:$G$29,DI3)>=1,\"\",ROW())","v":3},{"$f":"IF(ROW(DI3)-ROW(DI$2)+1>COUNT(DJ$2:DJ$9),\"\",INDEX(DI:DI,SMALL(DJ$2:DJ$9,1+ROW(DI3)-ROW(DI$2))))","v":"Unit 5 - Developing an Art and Design Portfolio"},null,"Unit 5 - Developing an Art and Design Portfolio",{"$f":"IF(COUNTIF('Extended Certificate'!$G$21:$G$29,DM3)>=1,\"\",ROW())","v":3},{"$f":"IF(ROW(DM3)-ROW(DM$2)+1>COUNT(DN$2:DN$9),\"\",INDEX(DM:DM,SMALL(DN$2:DN$9,1+ROW(DM3)-ROW(DM$2))))","v":"Unit 5 - Developing an Art and Design Portfolio"},null,{"$f":"IF(DQ18=1,\"\",\"Unit 4 - Communicating Ideas in 3D\")","v":"Unit 4 - Communicating Ideas in 3D"},{"$f":"IF(COUNTIF('Extended Certificate'!$G$21:$G$29,DQ3)>=1,\"\",ROW())","v":3},{"$f":"IF(ROW(DQ3)-ROW(DQ$2)+1>COUNT(DR$2:DR$11),\"\",INDEX(DQ:DQ,SMALL(DR$2:DR$11,1+ROW(DQ3)-ROW(DQ$2))))","v":"Unit 4 - Communicating Ideas in 3D"},null,"Unit 4 - Communicating Ideas in 3D",{"$f":"IF(COUNTIF('Extended Certificate'!$G$21:$G$29,DU3)>=1,\"\",ROW())","v":3},{"$f":"IF(ROW(DU3)-ROW(DU$2)+1>COUNT(DV$2:DV$12),\"\",INDEX(DU:DU,SMALL(DV$2:DV$12,1+ROW(DU3)-ROW(DU$2))))","v":"Unit 4 - Communicating Ideas in 3D"},null,"Unit 8 - Using Mobile Devices in Art and Design",{"$f":"IF(COUNTIF('Extended Certificate'!$G$21:$G$29,DY3)>=1,\"\",ROW())","v":3},{"$f":"IF(ROW(DY3)-ROW(DY$2)+1>COUNT(DZ$2:DZ$12),\"\",INDEX(DY:DY,SMALL(DZ$2:DZ$12,1+ROW(DY3)-ROW(DY$2))))","v":"Unit 8 - Using Mobile Devices in Art and Design"},null,"Unit 5 - Developing an Art and Design Portfolio",{"$f":"IF(COUNTIF('Extended Certificate'!$G$21:$G$29,EC3)>=1,\"\",ROW())","v":3},{"$f":"IF(ROW(EC3)-ROW(EC$2)+1>COUNT(ED$2:ED$10),\"\",INDEX(EC:EC,SMALL(ED$2:ED$10,1+ROW(EC3)-ROW(EC$2))))","v":"Unit 5 - Developing an Art and Design Portfolio"},null,null,null,null,null,"Unit 10 - Marketing and Promotion in Hospitality",{"$f":"IF(COUNTIF('Extended Certificate'!$G$31:$G$37,EK3)>=1,\"\",ROW())","v":3},{"$f":"IF(ROW(EK3)-ROW(EK$2)+1>COUNT(EL$2:EL$8),\"\",INDEX(EK:EK,SMALL(EL$2:EL$8,1+ROW(EK3)-ROW(EK$2))))","v":"Unit 10 - Marketing and Promotion in Hospitality"},null,"Unit 12 - The Development of Music",{"$f":"IF(COUNTIF('Extended Certificate'!$G$31:$G$37,EO3)>=1,\"\",ROW())","v":3},{"$f":"IF(ROW(EO3)-ROW(EO$2)+1>COUNT(EP$2:EP$12),\"\",INDEX(EO:EO,SMALL(EP$2:EP$12,1+ROW(EO3)-ROW(EO$2))))","v":"Unit 12 - The Development of Music"},null,"Unit 10 - World Energy",{"$f":"IF(COUNTIF('Extended Certificate'!$G$21:$G$29,ES3)>=1,\"\",ROW())","v":3},{"$f":"IF(ROW(ES3)-ROW(ES$2)+1>COUNT(ET$2:ET$17),\"\",INDEX(ES:ES,SMALL(ET$2:ET$17,1+ROW(ES3)-ROW(ES$2))))","v":"Unit 10 - World Energy"},null,"Unit 4 - Public Services and Community Protection",{"$f":"IF(COUNTIF('Extended Certificate'!$G$21:$G$29,EW3)>=1,\"\",ROW())","v":3},{"$f":"IF(ROW(EW3)-ROW(EW$2)+1>COUNT(EX$2:EX$15),\"\",INDEX(EW:EW,SMALL(EX$2:EX$15,1+ROW(EW3)-ROW(EW$2))))","v":"Unit 4 - Public Services and Community Protection"}]
["Unit 5 - Developing an Art and Design Portfolio",{"$f":"IF(COUNTIF('Extended Certificate'!$G$21:$G$29,A4)>=1,\"\",ROW())","v":4},"Unit 5 - Developing an Art and Design Portfolio",null,{"$f":"IF(AND(E23=0,E26=1),\"\",\"Unit 5 - Sales and Personal Selling\")","v":"Unit 5 - Sales and Personal Selling"},{"$f":"IF(COUNTIF('Extended Certificate'!$G$21:$G$29,E4)>=1,\"\",ROW())","v":4},"Unit 5 - Sales and Personal Selling",null,"Unit 7 - Making Healthy Food Choices for Children",{"$f":"IF(COUNTIF(Certificate!$G$17:$G$21,I4)>=1,\"\",ROW())","v":4},{"$f":"IF(ROW(I4)-ROW(I$2)+1>COUNT(J$2:J$5),\"\",INDEX(I:I,SMALL(J$2:J$5,1+ROW(I4)-ROW(I$2))))","v":"Unit 7 - Making Healthy Food Choices for Children"},null,{"$f":"IF(OR(P23=1,P26=1,P29=1,P32=1),\"\",\"Unit 6 - Exploring Carpentry and Joinery Principles and Techniques\")","v":"Unit 6 - Exploring Carpentry and Joinery Principles and Techniques"},{"$f":"IF(COUNTIF('Extended Certificate'!$G$21:$G$29,M4)>=1,\"\",ROW())","v":4},"Unit 6 - Exploring Carpentry and Joinery Principles and Techniques",null,"Unit 5 - Digital Publishing Production",{"$f":"IF(COUNTIF('Extended Certificate'!$G$21:$G$29,Q4)>=1,\"\",ROW())","v":4},"Unit 5 - Digital Publishing Production",null,"Unit 5 - Engineering Materials",{"$f":"IF(COUNTIF('Extended Certificate'!$G$21:$G$29,U4)>=1,\"\",ROW())","v":4},"Unit 5 - Engineering Materials",null,"Unit 6 - The Impact of Nutrition on Health and Wellbeing",{"$f":"IF(COUNTIF('Extended Certificate'!$G$21:$G$29,Y4)>=1,\"\",ROW())","v":4},"Unit 6 - The Impact of Nutrition on Health and Wellbeing",null,{"$f":"IF(OR(AF14=1,AF17=1),\"\",\"Unit 7 - Food and Beverage Service in the Hospitality Industry\")","v":"Unit 7 - Food and Beverage Service in the Hospitality Industry"},{"$f":"IF(COUNTIF('Extended Certificate'!$G$21:$G$29,AC4)>=1,\"\",ROW())","v":4},"Unit 7 - Food and Beverage Service in the Hospitality Industry",null,null,null,null,null,"Unit 6 - Creating Digital Graphics",{"$f":"IF(COUNTIF('Extended Certificate'!$G$21:$G$29,AK4)>=1,\"\",ROW())","v":4},"Unit 6 - Creating Digital Graphics",null,"Unit 5 - Introducing Music Performance",{"$f":"IF(COUNTIF('Extended Certificate'!$G$21:$G$29,AO4)>=1,\"\",ROW())","v":4},"Unit 5 - Introducing Music Performance",null,"Unit 5 - Musical Theatre Skills",{"$f":"IF(COUNTIF('Extended Certificate'!$G$21:$G$29,AS4)>=1,\"\",ROW())","v":4},"Unit 5 - Musical Theatre Skills",null,"Unit 11 - Devising Performance Work",{"$f":"IF(COUNTIF('Extended Certificate'!$G$31:$G$37,AW4)>=1,\"\",ROW())","v":4},{"$f":"IF(ROW(AW4)-ROW(AW$2)+1>COUNT(AX$2:AX$22),\"\",INDEX(AW:AW,SMALL(AX$2:AX$22,1+ROW(AW4)-ROW(AW$2))))","v":"Unit 11 - Devising Performance Work"},null,"Unit 11 - Devising Performance Work",{"$f":"IF(COUNTIF(Certificate!$G$23:$G$25,BA4)>=1,\"\",ROW())","v":4},"Unit 11 - Devising Performance Work",null,"Unit 11 - Devising Performance Work",{"$f":"IF(COUNTIF('Extended Certificate'!$G$21:$G$29,BE4)>=1,\"\",ROW())","v":4},"Unit 11 - Devising Performance Work",null,"Unit 18 - Jazz Dance Techniques",{"$f":"IF(COUNTIF('Extended Certificate'!$G$31:$G$37,BI4)>=1,\"\",ROW())","v":4},"Unit 18 - Jazz Dance Techniques",null,"Unit 21 - Realising Set Design for Performance",{"$f":"IF(COUNTIF('Extended Certificate'!$G$39,BM4)>=1,\"\",ROW())","v":4},"Unit 21 - Realising Set Design for Performance",null,null,null,null,null,"Unit 11 - Devising Performance Work",{"$f":"IF(COUNTIF('Extended Certificate'!$G$21:$G$29,BU4)>=1,\"\",ROW())","v":4},"Unit 11 - Devising Performance Work",null,null,null,null,null,"Unit 21 - Realising Set Design for Performance",{"$f":"IF(COUNTIF('Extended Certificate'!$G$39,CC4)>=1,\"\",ROW())","v":4},"Unit 21 - Realising Set Design for Performance",null,"Unit 11 - Devising Performance Work",{"$f":"IF(COUNTIF('Extended Certificate'!$G$21:$G$29,CG4)>=1,\"\",ROW())","v":4},{"$f":"IF(ROW(CG4)-ROW(CG$2)+1>COUNT(CH$2:CH$6),\"\",INDEX(BE:BE,SMALL(CH$2:CH$6,1+ROW(CG4)-ROW(CG$2))))","v":"Unit 11 - Devising Performance Work"},null,"Unit 17 - Exploring Urban Dance Styles",{"$f":"IF(COUNTIF(Certificate!$G$23:$G$25,CK4)>=1,\"\",ROW())","v":4},"Unit 17 - Exploring Urban Dance Styles",null,"Unit 20 - Realising Costume Design for Performance",{"$f":"IF(COUNTIF('Extended Certificate'!$G$21:$G$29,CO4)>=1,\"\",ROW())","v":4},"Unit 20 - Realising Costume Design for Performance",null,"Unit 12 - Exploring Improvisation",{"$f":"IF(COUNTIF('Extended Certificate'!$G$31:$G$37,CS4)>=1,\"\",ROW())","v":4},"Unit 12 - Exploring Improvisation",null,"Unit 5 - Training for Personal Fitness",{"$f":"IF(COUNTIF('Extended Certificate'!$G$21:$G$29,CW4)>=1,\"\",ROW())","v":4},"Unit 5 - Training for Personal Fitness",null,"Unit 6 -The Travel and Tourism Customer Experience",{"$f":"IF(COUNTIF('Extended Certificate'!$G$21:$G$29,DA4)>=1,\"\",ROW())","v":4},"Unit 6 -The Travel and Tourism Customer Experience",null,"Unit 11 - Animation for Digital Media",{"$f":"IF(COUNTIF('Extended Certificate'!$G$31:$G$37,DE4)>=1,\"\",ROW())","v":4},"Unit 11 - Animation for Digital Media",null,"Unit 10 - Fashion Briefs",{"$f":"IF(COUNTIF('Extended Certificate'!$G$21:$G$29,DI4)>=1,\"\",ROW())","v":4},"Unit 10 - Fashion Briefs",null,"Unit 9 - Design Crafts Briefs",{"$f":"IF(COUNTIF('Extended Certificate'!$G$21:$G$29,DM4)>=1,\"\",ROW())","v":4},"Unit 9 - Design Crafts Briefs",null,"Unit 5 - Developing an Art and Design Portfolio",{"$f":"IF(COUNTIF('Extended Certificate'!$G$21:$G$29,DQ4)>=1,\"\",ROW())","v":4},"Unit 5 - Developing an Art and Design Portfolio",null,"Unit 5 - Developing an Art and Design Portfolio",{"$f":"IF(COUNTIF('Extended Certificate'!$G$21:$G$29,DU4)>=1,\"\",ROW())","v":4},"Unit 5 - Developing an Art and Design Portfolio",null,"Unit 9 - Design Crafts Briefs",{"$f":"IF(COUNTIF('Extended Certificate'!$G$21:$G$29,DY4)>=1,\"\",ROW())","v":4},"Unit 9 - Design Crafts Briefs",null,"Unit 8 - Using Mobile Devices in Art and Design",{"$f":"IF(COUNTIF('Extended Certificate'!$G$21:$G$29,EC4)>=1,\"\",ROW())","v":4},"Unit 8 - Using Mobile Devices in Art and Design",null,null,null,null,null,"Unit 12 - Planning and Running a Hospitality Event",{"$f":"IF(COUNTIF('Extended Certificate'!$G$31:$G$37,EK4)>=1,\"\",ROW())","v":4},"Unit 12 - Planning and Running a Hospitality Event",null,"Unit 13 - Developing Music Composition",{"$f":"IF(COUNTIF('Extended Certificate'!$G$31:$G$37,EO4)>=1,\"\",ROW())","v":4},"Unit 13 - Developing Music Composition",null,"Unit 11 - How Scientific Theories are Formulated ",{"$f":"IF(COUNTIF('Extended Certificate'!$G$21:$G$29,ES4)>=1,\"\",ROW())","v":4},"Unit 11 - How Scientific Theories are Formulated ",null,"Unit 5 - Health, Fitness and Lifestyle for the Public Services",{"$f":"IF(COUNTIF('Extended Certificate'!$G$21:$G$29,EW4)>=1,\"\",ROW())","v":4},"Unit 5 - Health, Fitness and Lifestyle for the Public Services"]
["Unit 8 - Using Mobile Devices in Art and Design",{"$f":"IF(COUNTIF('Extended Certificate'!$G$21:$G$29,A5)>=1,\"\",ROW())","v":5},"Unit 8 - Using Mobile Devices in Art and Design",null,{"$f":"IF(AND(E23=0,E26=1),\"\",\"Unit 6 - Introducing Retail Business\")","v":"Unit 6 - Introducing Retail Business"},{"$f":"IF(COUNTIF('Extended Certificate'!$G$21:$G$29,E5)>=1,\"\",ROW())","v":5},"Unit 6 - Introducing Retail Business",null,"Unit 8 - Introduction to Working in the Early Years Sector",{"$f":"IF(COUNTIF(Certificate!$G$17:$G$21,I5)>=1,\"\",ROW())","v":5},{"$f":"IF(ROW(I5)-ROW(I$2)+1>COUNT(J$2:J$5),\"\",INDEX(I:I,SMALL(J$2:J$5,1+ROW(I5)-ROW(I$2))))","v":"Unit 8 - Introduction to Working in the Early Years Sector"},null,{"$f":"IF(OR(P20=1,P26=1,P29=1,P32=1),\"\",\"Unit 7 - Exploring Brickwork and Blockwork Principles and Techniques\")","v":"Unit 7 - Exploring Brickwork and Blockwork Principles and Techniques"},{"$f":"IF(COUNTIF('Extended Certificate'!$G$21:$G$29,M5)>=1,\"\",ROW())","v":5},"Unit 7 - Exploring Brickwork and Blockwork Principles and Techniques",null,"Unit 6 - Website Production",{"$f":"IF(COUNTIF('Extended Certificate'!$G$21:$G$29,Q5)>=1,\"\",ROW())","v":5},"Unit 6 - Website Production",null,"Unit 6 - Computer-aided Engineering",{"$f":"IF(COUNTIF('Extended Certificate'!$G$21:$G$29,U5)>=1,\"\",ROW())","v":5},"Unit 6 - Computer-aided Engineering",null,"Unit 7 - Equality and Diversity in Health and Social Care",{"$f":"IF(COUNTIF('Extended Certificate'!$G$21:$G$29,Y5)>=1,\"\",ROW())","v":5},"Unit 7 - Equality and Diversity in Health and Social Care",null,{"$f":"IF(OR(AF14=1,AF17=1),\"\",\"Unit 8 - Front Office Services in the Hospitality Industry\")","v":"Unit 8 - Front Office Services in the Hospitality Industry"},{"$f":"IF(COUNTIF('Extended Certificate'!$G$21:$G$29,AC5)>=1,\"\",ROW())","v":5},"Unit 8 - Front Office Services in the Hospitality Industry",null,null,null,null,null,"Unit 7 - Creating Digital Video",{"$f":"IF(COUNTIF('Extended Certificate'!$G$21:$G$29,AK5)>=1,\"\",ROW())","v":5},"Unit 7 - Creating Digital Video",null,"Unit 6 - Introducing Music Recording",{"$f":"IF(COUNTIF('Extended Certificate'!$G$21:$G$29,AO5)>=1,\"\",ROW())","v":5},"Unit 6 - Introducing Music Recording",null,"Unit 6 - Music Performance Skills",{"$f":"IF(COUNTIF('Extended Certificate'!$G$21:$G$29,AS5)>=1,\"\",ROW())","v":5},"Unit 6 - Music Performance Skills",null,"Unit 12 - Exploring Improvisation",{"$f":"IF(COUNTIF('Extended Certificate'!$G$31:$G$37,AW5)>=1,\"\",ROW())","v":5},"Unit 12 - Exploring Improvisation",null,"Unit 12 - Exploring Improvisation",{"$f":"IF(COUNTIF(Certificate!$G$23:$G$25,BA5)>=1,\"\",ROW())","v":5},"Unit 12 - Exploring Improvisation",null,"Unit 12 - Exploring Improvisation",{"$f":"IF(COUNTIF('Extended Certificate'!$G$21:$G$29,BE5)>=1,\"\",ROW())","v":5},"Unit 12 - Exploring Improvisation",null,null,null,null,null,"Unit 22 - Realising Prop Design for Performance",{"$f":"IF(COUNTIF('Extended Certificate'!$G$39,BM5)>=1,\"\",ROW())","v":5},"Unit 22 - Realising Prop Design for Performance",null,null,null,null,null,"Unit 16 - Contemporary Dance Techniques",{"$f":"IF(COUNTIF('Extended Certificate'!$G$21:$G$29,BU5)>=1,\"\",ROW())","v":5},"Unit 16 - Contemporary Dance Techniques",null,null,null,null,null,"Unit 22 - Realising Prop Design for Performance",{"$f":"IF(COUNTIF('Extended Certificate'!$G$39,CC5)>=1,\"\",ROW())","v":5},"Unit 22 - Realising Prop Design for Performance",null,"Unit 14 - Voice and Speech for Performers",{"$f":"IF(COUNTIF('Extended Certificate'!$G$21:$G$29,CG5)>=1,\"\",ROW())","v":5},{"$f":"IF(ROW(CG5)-ROW(CG$2)+1>COUNT(CH$2:CH$6),\"\",INDEX(BE:BE,SMALL(CH$2:CH$6,1+ROW(CG5)-ROW(CG$2))))","v":"Unit 12 - Exploring Improvisation"},null,"Unit 18 - Jazz Dance Techniques",{"$f":"IF(COUNTIF(Certificate!$G$23:$G$25,CK5)>=1,\"\",ROW())","v":5},"Unit 18 - Jazz Dance Techniques",null,"Unit 21 - Realising Set Design for Performance",{"$f":"IF(COUNTIF('Extended Certificate'!$G$21:$G$29,CO5)>=1,\"\",ROW())","v":5},"Unit 21 - Realising Set Design for Performance",null,"Unit 13 - Multimedia Performance",{"$f":"IF(COUNTIF('Extended Certificate'!$G$31:$G$37,CS5)>=1,\"\",ROW())","v":5},"Unit 13 - Multimedia Performance",null,"Unit 6 - Leading Sports Activities",{"$f":"IF(COUNTIF('Extended Certificate'!$G$21:$G$29,CW5)>=1,\"\",ROW())","v":5},"Unit 6 - Leading Sports Activities",null,"Unit 8 - Promotion and Sales in Travel and Tourism",{"$f":"IF(COUNTIF('Extended Certificate'!$G$21:$G$29,DA5)>=1,\"\",ROW())","v":5},"Unit 8 - Promotion and Sales in Travel and Tourism",null,"Unit 12 - Digital Audio Editing",{"$f":"IF(COUNTIF('Extended Certificate'!$G$31:$G$37,DE5)>=1,\"\",ROW())","v":5},"Unit 12 - Digital Audio Editing",null,"Unit 12 - Textiles Briefs",{"$f":"IF(COUNTIF('Extended Certificate'!$G$21:$G$29,DI5)>=1,\"\",ROW())","v":5},"Unit 12 - Textiles Briefs",null,"Unit 14 - Photography Briefs",{"$f":"IF(COUNTIF('Extended Certificate'!$G$21:$G$29,DM5)>=1,\"\",ROW())","v":5},"Unit 14 - Photography Briefs",null,"Unit 8 - Using Mobile Devices in Art and Design",{"$f":"IF(COUNTIF('Extended Certificate'!$G$21:$G$29,DQ5)>=1,\"\",ROW())","v":5},"Unit 8 - Using Mobile Devices in Art and Design",null,"Unit 8 - Using Mobile Devices in Art and Design",{"$f":"IF(COUNTIF('Extended Certificate'!$G$21:$G$29,DU5)>=1,\"\",ROW())","v":5},"Unit 8 - Using Mobile Devices in Art and Design",null,"Unit 10 - Fashion Briefs",{"$f":"IF(COUNTIF('Extended Certificate'!$G$21:$G$29,DY5)>=1,\"\",ROW())","v":5},"Unit 10 - Fashion Briefs",null,"Unit 10 - Fashion Briefs",{"$f":"IF(COUNTIF('Extended Certificate'!$G$21:$G$29,EC5)>=1,\"\",ROW())","v":5},"Unit 10 - Fashion Briefs",null,null,null,null,null,"Unit 13 - Contemporary World Food Cooking Skills",{"$f":"IF(COUNTIF('Extended Certificate'!$G$31:$G$37,EK5)>=1,\"\",ROW())","v":5},"Unit 13 - Contemporary World Food Cooking Skills",null,"Unit 14 - Producing a Music Recording",{"$f":"IF(COUNTIF('Extended Certificate'!$G$31:$G$37,EO5)>=1,\"\",ROW())","v":5},"Unit 14 - Producing a Music Recording",null,"Unit 12 - The Living Body",{"$f":"IF(COUNTIF('Extended Certificate'!$G$21:$G$29,ES5)>=1,\"\",ROW())","v":5},"Unit 12 - The Living Body",null,"Unit 8 - Promotion of Public Service Provision",{"$f":"IF(COUNTIF('Extended Certificate'!$G$21:$G$29,EW5)>=1,\"\",ROW())","v":5},"Unit 8 - Promotion of Public Service Provision"]
[{"$f":"IF(A26=1,\"\",\"Unit 9 - Design Crafts Briefs\")","v":"Unit 9 - Design Crafts Briefs"},{"$f":"IF(COUNTIF('Extended Certificate'!$G$21:$G$29,A6)>=1,\"\",ROW())","v":6},"Unit 9 - Design Crafts Briefs",null,{"$f":"IF(AND(E23=0,E26=1),\"\",\"Unit 7 - Providing Business Support\")","v":"Unit 7 - Providing Business Support"},{"$f":"IF(COUNTIF('Extended Certificate'!$G$21:$G$29,E6)>=1,\"\",ROW())","v":6},"Unit 7 - Providing Business Support",null,null,null,null,null,{"$f":"IF(OR(P20=1,P23=1,P29=1,P32=1),\"\",\"Unit 8 - Exploring Painting and Decorating Principles and Techniques\")","v":"Unit 8 - Exploring Painting and Decorating Principles and Techniques"},{"$f":"IF(COUNTIF('Extended Certificate'!$G$21:$G$29,M6)>=1,\"\",ROW())","v":6},"Unit 8 - Exploring Painting and Decorating Principles and Techniques",null,"Unit 7 - Digital Games Production",{"$f":"IF(COUNTIF('Extended Certificate'!$G$21:$G$29,Q6)>=1,\"\",ROW())","v":6},"Unit 7 - Digital Games Production",null,"Unit 7 - Machining Techniques",{"$f":"IF(COUNTIF('Extended Certificate'!$G$21:$G$29,U6)>=1,\"\",ROW())","v":6},"Unit 7 - Machining Techniques",null,"Unit 8 - Individual Rights in Health and Social Care",{"$f":"IF(COUNTIF('Extended Certificate'!$G$21:$G$29,Y6)>=1,\"\",ROW())","v":6},"Unit 8 - Individual Rights in Health and Social Care",null,{"$f":"IF(OR(AF14=1,AF17=1),\"\",\"Unit 11 - Accommodation Services in the Hospitality Industry\")","v":"Unit 11 - Accommodation Services in the Hospitality Industry"},{"$f":"IF(COUNTIF('Extended Certificate'!$G$21:$G$29,AC6)>=1,\"\",ROW())","v":6},"Unit 11 - Accommodation Services in the Hospitality Industry",null,null,null,null,null,"Unit 8 - Mobile Apps Development",{"$f":"IF(COUNTIF('Extended Certificate'!$G$21:$G$29,AK6)>=1,\"\",ROW())","v":6},"Unit 8 - Mobile Apps Development",null,"Unit 7 - Introducing Music Sequencing",{"$f":"IF(COUNTIF('Extended Certificate'!$G$21:$G$29,AO6)>=1,\"\",ROW())","v":6},"Unit 7 - Introducing Music Sequencing",null,"Unit 7 - Production Skills for Performance",{"$f":"IF(COUNTIF('Extended Certificate'!$G$21:$G$29,AS6)>=1,\"\",ROW())","v":6},"Unit 7 - Production Skills for Performance",null,"Unit 13 - Multimedia Performance",{"$f":"IF(COUNTIF('Extended Certificate'!$G$31:$G$37,AW6)>=1,\"\",ROW())","v":6},"Unit 13 - Multimedia Performance",null,"Unit 13 - Multimedia Performance",{"$f":"IF(COUNTIF(Certificate!$G$23:$G$25,BA6)>=1,\"\",ROW())","v":6},"Unit 13 - Multimedia Performance",null,"Unit 13 - Multimedia Performance",{"$f":"IF(COUNTIF('Extended Certificate'!$G$21:$G$29,BE6)>=1,\"\",ROW())","v":6},"Unit 13 - Multimedia Performance",null,null,null,null,null,"Unit 23 - Realising Mask Design for Performance",{"$f":"IF(COUNTIF('Extended Certificate'!$G$39,BM6)>=1,\"\",ROW())","v":6},"Unit 23 - Realising Mask Design for Performance",null,null,null,null,null,"Unit 17 - Exploring Urban Dance Styles",{"$f":"IF(COUNTIF('Extended Certificate'!$G$21:$G$29,BU6)>=1,\"\",ROW())","v":6},"Unit 17 - Exploring Urban Dance Styles",null,null,null,null,null,"Unit 23 - Realising Mask Design for Performance",{"$f":"IF(COUNTIF('Extended Certificate'!$G$39,CC6)>=1,\"\",ROW())","v":6},"Unit 23 - Realising Mask Design for Performance",null,null,null,null,null,"Unit 19 - Design Planning for Performance",{"$f":"IF(COUNTIF(Certificate!$G$23:$G$25,CK6)>=1,\"\",ROW())","v":6},"Unit 19 - Design Planning for Performance",null,"Unit 22 - Realising Prop Design for Performance",{"$f":"IF(COUNTIF('Extended Certificate'!$G$21:$G$29,CO6)>=1,\"\",ROW())","v":6},"Unit 22 - Realising Prop Design for Performance",null,"Unit 14 - Voice and Speech for Performers",{"$f":"IF(COUNTIF('Extended Certificate'!$G$31:$G$37,CS6)>=1,\"\",ROW())","v":6},"Unit 14 - Voice and Speech for Performers",null,"Unit 8 - Promotion and Sponsorship in Sport",{"$f":"IF(COUNTIF('Extended Certificate'!$G$21:$G$29,CW6)>=1,\"\",ROW())","v":6},"Unit 8 - Promotion and Sponsorship in Sport",null,"Unit 9 - Travel and Tourism Employment Opportunities",{"$f":"IF(COUNTIF('Extended Certificate'!$G$21:$G$29,DA6)>=1,\"\",ROW())","v":6},"Unit 9 - Travel and Tourism Employment Opportunities",null,"Unit 13 - Graphic Design for Digital Media",{"$f":"IF(COUNTIF('Extended Certificate'!$G$31:$G$37,DE6)>=1,\"\",ROW())","v":6},"Unit 13 - Graphic Design for Digital Media",null,"Unit 15 - Designing for the Future",{"$f":"IF(COUNTIF('Extended Certificate'!$G$21:$G$29,DI6)>=1,\"\",ROW())","v":6},"Unit 15 - Designing for the Future",null,"Unit 15 - Designing for the Future",{"$f":"IF(COUNTIF('Extended Certificate'!$G$21:$G$29,DM6)>=1,\"\",ROW())","v":6},"Unit 15 - Designing for the Future",null,"Unit 10 - Fashion Briefs",{"$f":"IF(COUNTIF('Extended Certificate'!$G$21:$G$29,DQ6)>=1,\"\",ROW())","v":6},"Unit 10 - Fashion Briefs",null,"Unit 10 - Fashion Briefs",{"$f":"IF(COUNTIF('Extended Certificate'!$G$21:$G$29,DU6)>=1,\"\",ROW())","v":6},"Unit 10 - Fashion Briefs",null,"Unit 11 - Graphic Design Briefs",{"$f":"IF(COUNTIF('Extended Certificate'!$G$21:$G$29,DY6)>=1,\"\",ROW())","v":6},"Unit 11 - Graphic Design Briefs",null,"Unit 14 - Photography Briefs",{"$f":"IF(COUNTIF('Extended Certificate'!$G$21:$G$29,EC6)>=1,\"\",ROW())","v":6},"Unit 14 - Photography Briefs",null,null,null,null,null,"Unit 15 - Menu Planning",{"$f":"IF(COUNTIF('Extended Certificate'!$G$31:$G$37,EK6)>=1,\"\",ROW())","v":6},"Unit 15 - Menu Planning",null,"Unit 15 - Music Ensemble",{"$f":"IF(COUNTIF('Extended Certificate'!$G$31:$G$37,EO6)>=1,\"\",ROW())","v":6},"Unit 15 - Music Ensemble",null,"Unit 13 - Monitoring the Environment ",{"$f":"IF(COUNTIF('Extended Certificate'!$G$21:$G$29,ES6)>=1,\"\",ROW())","v":6},"Unit 13 - Monitoring the Environment ",null,"Unit 9 - Community and Cultural Awareness",{"$f":"IF(COUNTIF('Extended Certificate'!$G$21:$G$29,EW6)>=1,\"\",ROW())","v":6},"Unit 9 - Community and Cultural Awareness"]
["Unit 10 - Fashion Briefs",{"$f":"IF(COUNTIF('Extended Certificate'!$G$21:$G$29,A7)>=1,\"\",ROW())","v":7},"Unit 10 - Fashion Briefs",null,{"$f":"IF(AND(E23=0,E26=1),\"\",\"Unit 8 - Recruitment, Selection and Employment\")","v":"Unit 8 - Recruitment, Selection and Employment"},{"$f":"IF(COUNTIF('Extended Certificate'!$G$21:$G$29,E7)>=1,\"\",ROW())","v":7},"Unit 8 - Recruitment, Selection and Employment",null,null,null,null,null,{"$f":"IF(OR(P20=1,P23=1,P26=1,P32=1),\"\",\"Unit 9 - Exploring Plumbing Principles and Techniques\")","v":"Unit 9 - Exploring Plumbing Principles and Techniques"},{"$f":"IF(COUNTIF('Extended Certificate'!$G$21:$G$29,M7)>=1,\"\",ROW())","v":7},"Unit 9 - Exploring Plumbing Principles and Techniques",null,null,null,null,null,"Unit 8 - Electronic Circuit Design and Construction",{"$f":"IF(COUNTIF('Extended Certificate'!$G$21:$G$29,U7)>=1,\"\",ROW())","v":7},"Unit 8 - Electronic Circuit Design and Construction",null,"Unit 10 - Human Body Systems and Care of Disorders",{"$f":"IF(COUNTIF('Extended Certificate'!$G$21:$G$29,Y7)>=1,\"\",ROW())","v":7},"Unit 10 - Human Body Systems and Care of Disorders",null,null,null,null,null,null,null,null,null,"Unit 9 - Spreadsheet Development",{"$f":"IF(COUNTIF('Extended Certificate'!$G$21:$G$29,AK7)>=1,\"\",ROW())","v":7},"Unit 9 - Spreadsheet Development",null,"Unit 9 - Introducing Choral Studies",{"$f":"IF(COUNTIF('Extended Certificate'!$G$21:$G$29,AO7)>=1,\"\",ROW())","v":7},"Unit 9 - Introducing Choral Studies",null,null,null,"",null,"Unit 14 - Voice and Speech for Performers",{"$f":"IF(COUNTIF('Extended Certificate'!$G$31:$G$37,AW7)>=1,\"\",ROW())","v":7},"Unit 14 - Voice and Speech for Performers",null,"Unit 14 - Voice and Speech for Performers",{"$f":"IF(COUNTIF(Certificate!$G$23:$G$25,BA7)>=1,\"\",ROW())","v":7},"Unit 14 - Voice and Speech for Performers",null,"Unit 14 - Voice and Speech for Performers",{"$f":"IF(COUNTIF('Extended Certificate'!$G$21:$G$29,BE7)>=1,\"\",ROW())","v":7},"Unit 14 - Voice and Speech for Performers",null,null,null,null,null,"Unit 24 - Lighting for Performance",{"$f":"IF(COUNTIF('Extended Certificate'!$G$39,BM7)>=1,\"\",ROW())","v":7},"Unit 24 - Lighting for Performance",null,null,null,null,null,"Unit 18 - Jazz Dance Techniques",{"$f":"IF(COUNTIF('Extended Certificate'!$G$21:$G$29,BU7)>=1,\"\",ROW())","v":7},"Unit 18 - Jazz Dance Techniques",null,null,null,null,null,"Unit 24 - Lighting for Performance",{"$f":"IF(COUNTIF('Extended Certificate'!$G$39,CC7)>=1,\"\",ROW())","v":7},"Unit 24 - Lighting for Performance",null,null,null,null,null,"Unit 20 - Realising Costume Design for Performance",{"$f":"IF(COUNTIF(Certificate!$G$23:$G$25,CK7)>=1,\"\",ROW())","v":7},"Unit 20 - Realising Costume Design for Performance",null,"Unit 23 - Realising Mask Design for Performance",{"$f":"IF(COUNTIF('Extended Certificate'!$G$21:$G$29,CO7)>=1,\"\",ROW())","v":7},"Unit 23 - Realising Mask Design for Performance",null,"Unit 15 - Performing Scripted Plays",{"$f":"IF(COUNTIF('Extended Certificate'!$G$31:$G$37,CS7)>=1,\"\",ROW())","v":7},"Unit 15 - Performing Scripted Plays",null,"Unit 9 - Lifestyle and Well-being",{"$f":"IF(COUNTIF('Extended Certificate'!$G$21:$G$29,CW7)>=1,\"\",ROW())","v":7},"Unit 9 - Lifestyle and Well-being",null,"Unit 10 - Organising a Travel and Tourism Study Visit",{"$f":"IF(COUNTIF('Extended Certificate'!$G$21:$G$29,DA7)>=1,\"\",ROW())","v":7},"Unit 10 - Organising a Travel and Tourism Study Visit",null,"Unit 14 - Writing for Digital Media",{"$f":"IF(COUNTIF('Extended Certificate'!$G$31:$G$37,DE7)>=1,\"\",ROW())","v":7},"Unit 14 - Writing for Digital Media",null,"Unit 16 - Applying Contextual References in Art and Design",{"$f":"IF(COUNTIF('Extended Certificate'!$G$21:$G$29,DI7)>=1,\"\",ROW())","v":7},"Unit 16 - Applying Contextual References in Art and Design",null,"Unit 16 - Applying Contextual References in Art and Design",{"$f":"IF(COUNTIF('Extended Certificate'!$G$21:$G$29,DM7)>=1,\"\",ROW())","v":7},"Unit 16 - Applying Contextual References in Art and Design",null,"Unit 15 - Designing for the Future",{"$f":"IF(COUNTIF('Extended Certificate'!$G$21:$G$29,DQ7)>=1,\"\",ROW())","v":7},"Unit 15 - Designing for the Future",null,{"$f":"IF(DU15=1,\"\",\"Unit 11 - Graphic Design Briefs\")","v":"Unit 11 - Graphic Design Briefs"},{"$f":"IF(COUNTIF('Extended Certificate'!$G$21:$G$29,DU7)>=1,\"\",ROW())","v":7},"Unit 11 - Graphic Design Briefs",null,"Unit 12 - Textiles Briefs",{"$f":"IF(COUNTIF('Extended Certificate'!$G$21:$G$29,DY7)>=1,\"\",ROW())","v":7},"Unit 12 - Textiles Briefs",null,"Unit 15 - Designing for the Future",{"$f":"IF(COUNTIF('Extended Certificate'!$G$21:$G$29,EC7)>=1,\"\",ROW())","v":7},"Unit 15 - Designing for the Future",null,null,null,null,null,"Unit 16 - Managing Finance in Hospitality",{"$f":"IF(COUNTIF('Extended Certificate'!$G$31:$G$37,EK7)>=1,\"\",ROW())","v":7},"Unit 16 - Managing Finance in Hospitality",null,"Unit 18 - Developing Modern Music Production Skills",{"$f":"IF(COUNTIF('Extended Certificate'!$G$31:$G$37,EO7)>=1,\"\",ROW())","v":7},"Unit 18 - Developing Modern Music Production Skills",null,"Unit 14 - Growing Plants for Food ",{"$f":"IF(COUNTIF('Extended Certificate'!$G$21:$G$29,ES7)>=1,\"\",ROW())","v":7},"Unit 14 - Growing Plants for Food ",null,{"$f":"IF(EW23=1,\"\",\"Unit 10 - Adventurous Activities in the Public Services\")","v":"Unit 10 - Adventurous Activities in the Public Services"},{"$f":"IF(COUNTIF('Extended Certificate'!$G$21:$G$29,EW7)>=1,\"\",ROW())","v":7},"Unit 10 - Adventurous Activities in the Public Services"]
[{"$f":"IF(A23=1,\"\",\"Unit 11 - Graphic Design Briefs\")","v":"Unit 11 - Graphic Design Briefs"},{"$f":"IF(COUNTIF('Extended Certificate'!$G$21:$G$29,A8)>=1,\"\",ROW())","v":8},"Unit 11 - Graphic Design Briefs",null,{"$f":"IF(AND(E23=0,E26=1),\"\",\"Unit 10 - Using Business Documentation\")","v":"Unit 10 - Using Business Documentation"},{"$f":"IF(COUNTIF('Extended Certificate'!$G$21:$G$29,E8)>=1,\"\",ROW())","v":8},"Unit 10 - Using Business Documentation",null,null,null,null,null,{"$f":"IF(OR(P20=1,P23=1,P26=1,P29=1),\"\",\"Unit 10 - Exploring Electrical Principles and Techniques\")","v":"Unit 10 - Exploring Electrical Principles and Techniques"},{"$f":"IF(COUNTIF('Extended Certificate'!$G$21:$G$29,M8)>=1,\"\",ROW())","v":8},"Unit 10 - Exploring Electrical Principles and Techniques",null,null,null,null,null,"Unit 11 - Electrical and Mechanical Science for Engineering",{"$f":"IF(COUNTIF('Extended Certificate'!$G$21:$G$29,U8)>=1,\"\",ROW())","v":8},"Unit 11 - Electrical and Mechanical Science for Engineering",null,"Unit 11 - Services in Health and Social Care",{"$f":"IF(COUNTIF('Extended Certificate'!$G$21:$G$29,Y8)>=1,\"\",ROW())","v":8},"Unit 11 - Services in Health and Social Care",null,null,null,null,null,null,null,null,null,"Unit 10 - Database Development",{"$f":"IF(COUNTIF('Extended Certificate'!$G$21:$G$29,AK8)>=1,\"\",ROW())","v":8},"Unit 10 - Database Development",null,"Unit 10 - Introducing Music Theory",{"$f":"IF(COUNTIF('Extended Certificate'!$G$21:$G$29,AO8)>=1,\"\",ROW())","v":8},"Unit 10 - Introducing Music Theory",null,null,null,null,null,"Unit 15 - Performing Scripted Plays",{"$f":"IF(COUNTIF('Extended Certificate'!$G$31:$G$37,AW8)>=1,\"\",ROW())","v":8},"Unit 15 - Performing Scripted Plays",null,"Unit 15 - Performing Scripted Plays",{"$f":"IF(COUNTIF(Certificate!$G$23:$G$25,BA8)>=1,\"\",ROW())","v":8},"Unit 15 - Performing Scripted Plays",null,"Unit 15 - Performing Scripted Plays",{"$f":"IF(COUNTIF('Extended Certificate'!$G$21:$G$29,BE8)>=1,\"\",ROW())","v":8},"Unit 15 - Performing Scripted Plays",null,null,null,null,null,"Unit 25 - Sound for Performance",{"$f":"IF(COUNTIF('Extended Certificate'!$G$39,BM8)>=1,\"\",ROW())","v":8},"Unit 25 - Sound for Performance",null,null,null,null,null,null,null,null,null,null,null,null,null,"Unit 25 - Sound for Performance",{"$f":"IF(COUNTIF('Extended Certificate'!$G$39,CC8)>=1,\"\",ROW())","v":8},"Unit 25 - Sound for Performance",null,null,null,null,null,"Unit 21 - Realising Set Design for Performance",{"$f":"IF(COUNTIF(Certificate!$G$23:$G$25,CK8)>=1,\"\",ROW())","v":8},"Unit 21 - Realising Set Design for Performance",null,"Unit 24 - Lighting for Performance",{"$f":"IF(COUNTIF('Extended Certificate'!$G$21:$G$29,CO8)>=1,\"\",ROW())","v":8},"Unit 24 - Lighting for Performance",null,"Unit 16 - Contemporary Dance Techniques",{"$f":"IF(COUNTIF('Extended Certificate'!$G$31:$G$37,CS8)>=1,\"\",ROW())","v":8},"Unit 16 - Contemporary Dance Techniques",null,"Unit 10 - Injury and the Sports Performer",{"$f":"IF(COUNTIF('Extended Certificate'!$G$21:$G$29,CW8)>=1,\"\",ROW())","v":8},"Unit 10 - Injury and the Sports Performer",null,"Unit 16 - Holiday Representatives",{"$f":"IF(COUNTIF('Extended Certificate'!$G$21:$G$29,DA8)>=1,\"\",ROW())","v":8},"Unit 16 - Holiday Representatives",null,"Unit 15 - Digital Games Testing",{"$f":"IF(COUNTIF('Extended Certificate'!$G$31:$G$37,DE8)>=1,\"\",ROW())","v":8},"Unit 15 - Digital Games Testing",null,"Unit 17 - Art, Craft and Design in the Creative Industries",{"$f":"IF(COUNTIF('Extended Certificate'!$G$21:$G$29,DI8)>=1,\"\",ROW())","v":8},"Unit 17 - Art, Craft and Design in the Creative Industries",null,"Unit 17 - Art, Craft and Design in the Creative Industries",{"$f":"IF(COUNTIF('Extended Certificate'!$G$21:$G$29,DM8)>=1,\"\",ROW())","v":8},"Unit 17 - Art, Craft and Design in the Creative Industries",null,"Unit 16 - Applying Contextual References in Art and Design",{"$f":"IF(COUNTIF('Extended Certificate'!$G$21:$G$29,DQ8)>=1,\"\",ROW())","v":8},"Unit 16 - Applying Contextual References in Art and Design",null,"Unit 12 - Textiles Briefs",{"$f":"IF(COUNTIF('Extended Certificate'!$G$21:$G$29,DU8)>=1,\"\",ROW())","v":8},"Unit 12 - Textiles Briefs",null,"Unit 14 - Photography Briefs",{"$f":"IF(COUNTIF('Extended Certificate'!$G$21:$G$29,DY8)>=1,\"\",ROW())","v":8},"Unit 14 - Photography Briefs",null,"Unit 16 - Applying Contextual References in Art and Design",{"$f":"IF(COUNTIF('Extended Certificate'!$G$21:$G$29,EC8)>=1,\"\",ROW())","v":8},"Unit 16 - Applying Contextual References in Art and Design",null,null,null,null,null,"Unit 17 - Alcohol Awareness in Hospitality",{"$f":"IF(COUNTIF('Extended Certificate'!$G$31:$G$37,EK8)>=1,\"\",ROW())","v":8},"Unit 17 - Alcohol Awareness in Hospitality",null,"Unit 19 - Developing Music Theory",{"$f":"IF(COUNTIF('Extended Certificate'!$G$31:$G$37,EO8)>=1,\"\",ROW())","v":8},"Unit 19 - Developing Music Theory",null,"Unit 15 - Investigating a Crime Scene ",{"$f":"IF(COUNTIF('Extended Certificate'!$G$21:$G$29,ES8)>=1,\"\",ROW())","v":8},"Unit 15 - Investigating a Crime Scene ",null,"Unit 11 - Sport and Recreation in the Public Services",{"$f":"IF(COUNTIF('Extended Certificate'!$G$21:$G$29,EW8)>=1,\"\",ROW())","v":8},"Unit 11 - Sport and Recreation in the Public Services"]
["Unit 12 - Textiles Briefs",{"$f":"IF(COUNTIF('Extended Certificate'!$G$21:$G$29,A9)>=1,\"\",ROW())","v":9},"Unit 12 - Textiles Briefs",null,{"$f":"IF(AND(E23=0,E26=1),\"\",\"Unit 11 - Building Successful Business Teams\")","v":"Unit 11 - Building Successful Business Teams"},{"$f":"IF(COUNTIF('Extended Certificate'!$G$21:$G$29,E9)>=1,\"\",ROW())","v":9},"Unit 11 - Building Successful Business Teams",null,null,null,null,null,{"$f":"IF(OR(P20=1,P23=1,P26=1,P29=1,P32=1),\"\",\"Unit 12 - The Construction Industry\")","v":"Unit 12 - The Construction Industry"},{"$f":"IF(COUNTIF('Extended Certificate'!$G$21:$G$29,M9)>=1,\"\",ROW())","v":9},"Unit 12 - The Construction Industry",null,null,null,null,null,"Unit 12 - Engineering Design",{"$f":"IF(COUNTIF('Extended Certificate'!$G$21:$G$29,U9)>=1,\"\",ROW())","v":9},"Unit 12 - Engineering Design",null,"Unit 12 - Creative and Therapeutic Activities in Health and Social Care",{"$f":"IF(COUNTIF('Extended Certificate'!$G$21:$G$29,Y9)>=1,\"\",ROW())","v":9},"Unit 12 - Creative and Therapeutic Activities in Health and Social Care",null,null,null,null,null,null,null,null,null,"Unit 11 - Computer Networks",{"$f":"IF(COUNTIF('Extended Certificate'!$G$21:$G$29,AK9)>=1,\"\",ROW())","v":9},"Unit 11 - Computer Networks",null,null,null,null,null,null,null,null,null,"Unit 16 - Contemporary Dance Techniques",{"$f":"IF(COUNTIF('Extended Certificate'!$G$31:$G$37,AW9)>=1,\"\",ROW())","v":9},"Unit 16 - Contemporary Dance Techniques",null,"Unit 16 - Contemporary Dance Techniques",{"$f":"IF(COUNTIF(Certificate!$G$23:$G$25,BA9)>=1,\"\",ROW())","v":9},"Unit 16 - Contemporary Dance Techniques",null,null,null,null,null,null,null,null,null,"Unit 28 - Make-up for Performance",{"$f":"IF(COUNTIF('Extended Certificate'!$G$39,BM9)>=1,\"\",ROW())","v":9},"Unit 28 - Make-up for Performance",null,null,null,null,null,null,null,null,null,null,null,null,null,"Unit 28 - Make-up for Performance",{"$f":"IF(COUNTIF('Extended Certificate'!$G$39,CC9)>=1,\"\",ROW())","v":9},"Unit 28 - Make-up for Performance",null,null,null,null,null,"Unit 22 - Realising Prop Design for Performance",{"$f":"IF(COUNTIF(Certificate!$G$23:$G$25,CK9)>=1,\"\",ROW())","v":9},"Unit 22 - Realising Prop Design for Performance",null,"Unit 25 - Sound for Performance",{"$f":"IF(COUNTIF('Extended Certificate'!$G$21:$G$29,CO9)>=1,\"\",ROW())","v":9},"Unit 25 - Sound for Performance",null,"Unit 17 - Exploring Urban Dance Styles",{"$f":"IF(COUNTIF('Extended Certificate'!$G$31:$G$37,CS9)>=1,\"\",ROW())","v":9},"Unit 17 - Exploring Urban Dance Styles",null,"Unit 11 - Running a Sports Event",{"$f":"IF(COUNTIF('Extended Certificate'!$G$21:$G$29,CW9)>=1,\"\",ROW())","v":9},"Unit 11 - Running a Sports Event",null,"Unit 17 - UK Travel Agency Operations",{"$f":"IF(COUNTIF('Extended Certificate'!$G$21:$G$29,DA9)>=1,\"\",ROW())","v":9},"Unit 17 - UK Travel Agency Operations",null,"Unit 16 - Digital Art for a Media Product ",{"$f":"IF(COUNTIF('Extended Certificate'!$G$31:$G$37,DE9)>=1,\"\",ROW())","v":9},"Unit 16 - Digital Art for a Media Product ",null,{"$f":"IF(DI14=1,\"\",\"Unit 21 - Painting Briefs\")","v":"Unit 21 - Painting Briefs"},{"$f":"IF(COUNTIF('Extended Certificate'!$G$21:$G$29,DI9)>=1,\"\",ROW())","v":9},"Unit 21 - Painting Briefs",null,"Unit 22 - Designing Products",{"$f":"IF(COUNTIF('Extended Certificate'!$G$21:$G$29,DM9)>=1,\"\",ROW())","v":9},{"$f":"IF(ROW(DM9)-ROW(DM$2)+1>COUNT(DN$2:DN$9),\"\",INDEX(DM:DM,SMALL(DN$2:DN$9,1+ROW(DM9)-ROW(DM$2))))","v":"Unit 22 - Designing Products"},null,"Unit 17 - Art, Craft and Design in the Creative Industries",{"$f":"IF(COUNTIF('Extended Certificate'!$G$21:$G$29,DQ9)>=1,\"\",ROW())","v":9},"Unit 17 - Art, Craft and Design in the Creative Industries",null,"Unit 16 - Applying Contextual References in Art and Design",{"$f":"IF(COUNTIF('Extended Certificate'!$G$21:$G$29,DU9)>=1,\"\",ROW())","v":9},"Unit 16 - Applying Contextual References in Art and Design",null,"Unit 16 - Applying Contextual References in Art and Design",{"$f":"IF(COUNTIF('Extended Certificate'!$G$21:$G$29,DY9)>=1,\"\",ROW())","v":9},"Unit 16 - Applying Contextual References in Art and Design",null,"Unit 17 - Art, Craft and Design in the Creative Industries",{"$f":"IF(COUNTIF('Extended Certificate'!$G$21:$G$29,EC9)>=1,\"\",ROW())","v":9},"Unit 17 - Art, Craft and Design in the Creative Industries",null,null,null,null,null,null,null,null,null,"Unit 20 - Music Fusion",{"$f":"IF(COUNTIF('Extended Certificate'!$G$31:$G$37,EO9)>=1,\"\",ROW())","v":9},"Unit 20 - Music Fusion",null,"Unit 16 - Science in Medicine ",{"$f":"IF(COUNTIF('Extended Certificate'!$G$21:$G$29,ES9)>=1,\"\",ROW())","v":9},"Unit 16 - Science in Medicine ",null,"Unit 12 - Land Navigation by Map and Compass",{"$f":"IF(COUNTIF('Extended Certificate'!$G$21:$G$29,EW9)>=1,\"\",ROW())","v":9},"Unit 12 - Land Navigation by Map and Compass"]
[{"$f":"IF(OR(A23=1,A26=1),\"\",\"Unit 13 - Visual Arts Briefs\")","v":"Unit 13 - Visual Arts Briefs"},{"$f":"IF(COUNTIF('Extended Certificate'!$G$21:$G$29,A10)>=1,\"\",ROW())","v":10},"Unit 13 - Visual Arts Briefs",null,{"$f":"IF(AND(E23=0,E26=1),\"\",\"Unit 12 - Introducing Law and Consumer Rights\")","v":"Unit 12 - Introducing Law and Consumer Rights"},{"$f":"IF(COUNTIF('Extended Certificate'!$G$21:$G$29,E10)>=1,\"\",ROW())","v":10},"Unit 12 - Introducing Law and Consumer Rights",null,null,null,null,null,{"$f":"IF(OR(P20=1,P23=1,P26=1,P29=1,P32=1),\"\",\"Unit 13 - Exploring Roofing Principles and Techniques\")","v":"Unit 13 - Exploring Roofing Principles and Techniques"},{"$f":"IF(COUNTIF('Extended Certificate'!$G$21:$G$29,M10)>=1,\"\",ROW())","v":10},"Unit 13 - Exploring Roofing Principles and Techniques",null,null,null,null,null,"Unit 13 - Engineering Assembly",{"$f":"IF(COUNTIF('Extended Certificate'!$G$21:$G$29,U10)>=1,\"\",ROW())","v":10},"Unit 13 - Engineering Assembly",null,{"$f":"IF(Y23=1,\"\",\"Unit 13 - The Health and Social Care Sector\")","v":"Unit 13 - The Health and Social Care Sector"},{"$f":"IF(COUNTIF('Extended Certificate'!$G$21:$G$29,Y10)>=1,\"\",ROW())","v":10},"Unit 13 - The Health and Social Care Sector",null,null,null,null,null,null,null,null,null,"Unit 12 - Software Development",{"$f":"IF(COUNTIF('Extended Certificate'!$G$21:$G$29,AK10)>=1,\"\",ROW())","v":10},"Unit 12 - Software Development",null,null,null,null,null,null,null,null,null,"Unit 17 - Exploring Urban Dance Styles",{"$f":"IF(COUNTIF('Extended Certificate'!$G$31:$G$37,AW10)>=1,\"\",ROW())","v":10},"Unit 17 - Exploring Urban Dance Styles",null,"Unit 17 - Exploring Urban Dance Styles",{"$f":"IF(COUNTIF(Certificate!$G$23:$G$25,BA10)>=1,\"\",ROW())","v":10},"Unit 17 - Exploring Urban Dance Styles",null,null,null,null,null,null,null,null,null,"Unit 29 - Wardrobe for Stage Performance",{"$f":"IF(COUNTIF('Extended Certificate'!$G$39,BM10)>=1,\"\",ROW())","v":10},"Unit 29 - Wardrobe for Stage Performance",null,null,null,null,null,null,null,null,null,null,null,null,null,"Unit 29 - Wardrobe for Stage Performance",{"$f":"IF(COUNTIF('Extended Certificate'!$G$39,CC10)>=1,\"\",ROW())","v":10},"Unit 29 - Wardrobe for Stage Performance",null,null,null,null,null,"Unit 23 - Realising Mask Design for Performance",{"$f":"IF(COUNTIF(Certificate!$G$23:$G$25,CK10)>=1,\"\",ROW())","v":10},"Unit 23 - Realising Mask Design for Performance",null,"Unit 28 - Make-up for Performance",{"$f":"IF(COUNTIF('Extended Certificate'!$G$21:$G$29,CO10)>=1,\"\",ROW())","v":10},"Unit 28 - Make-up for Performance",null,"Unit 18 - Jazz Dance Techniques",{"$f":"IF(COUNTIF('Extended Certificate'!$G$31:$G$37,CS10)>=1,\"\",ROW())","v":10},"Unit 18 - Jazz Dance Techniques",null,"Unit 12 - The Sport and Active Leisure Industry",{"$f":"IF(COUNTIF('Extended Certificate'!$G$21:$G$29,CW10)>=1,\"\",ROW())","v":10},"Unit 12 - The Sport and Active Leisure Industry",null,"Unit 18 - The Cruise Industry",{"$f":"IF(COUNTIF('Extended Certificate'!$G$21:$G$29,DA10)>=1,\"\",ROW())","v":10},"Unit 18 - The Cruise Industry",null,"Unit 17 - Digital Audio Mixing ",{"$f":"IF(COUNTIF('Extended Certificate'!$G$31:$G$37,DE10)>=1,\"\",ROW())","v":10},"Unit 17 - Digital Audio Mixing ",null,null,null,null,null,null,null,null,null,"Unit 20 - Interactive Media Production Briefs",{"$f":"IF(COUNTIF('Extended Certificate'!$G$21:$G$29,DQ10)>=1,\"\",ROW())","v":10},"Unit 20 - Interactive Media Production Briefs",null,"Unit 17 - Art, Craft and Design in the Creative Industries",{"$f":"IF(COUNTIF('Extended Certificate'!$G$21:$G$29,DU10)>=1,\"\",ROW())","v":10},"Unit 17 - Art, Craft and Design in the Creative Industries",null,"Unit 17 - Art, Craft and Design in the Creative Industries",{"$f":"IF(COUNTIF('Extended Certificate'!$G$21:$G$29,DY10)>=1,\"\",ROW())","v":10},"Unit 17 - Art, Craft and Design in the Creative Industries",null,"Unit 19 - Digital Art and Design Briefs",{"$f":"IF(COUNTIF('Extended Certificate'!$G$21:$G$29,EC10)>=1,\"\",ROW())","v":10},"Unit 19 - Digital Art and Design Briefs",null,null,null,null,null,null,null,null,null,"Unit 21 - Music Arrangement",{"$f":"IF(COUNTIF('Extended Certificate'!$G$31:$G$37,EO10)>=1,\"\",ROW())","v":10},"Unit 21 - Music Arrangement",null,"Unit 17 - Understanding Human Behaviour ",{"$f":"IF(COUNTIF('Extended Certificate'!$G$21:$G$29,ES10)>=1,\"\",ROW())","v":10},"Unit 17 - Understanding Human Behaviour ",null,"Unit 13 - Volunteering for the Public Services",{"$f":"IF(COUNTIF('Extended Certificate'!$G$21:$G$29,EW10)>=1,\"\",ROW())","v":10},"Unit 13 - Volunteering for the Public Services"]
["Unit 14 - Photography Briefs",{"$f":"IF(COUNTIF('Extended Certificate'!$G$21:$G$29,A11)>=1,\"\",ROW())","v":11},"Unit 14 - Photography Briefs",null,{"$f":"IF(AND(E23=0,E26=1),\"\",\"Unit 13 - Financial Planning and Forecasting\")","v":"Unit 13 - Financial Planning and Forecasting"},{"$f":"IF(COUNTIF('Extended Certificate'!$G$21:$G$29,E11)>=1,\"\",ROW())","v":11},"Unit 13 - Financial Planning and Forecasting",null,null,null,null,null,{"$f":"IF(OR(P20=1,P23=1,P26=1,P29=1,P32=1),\"\",\"Unit 14 - Exploring Wall and Floor Tiling Principles and Techniques\")","v":"Unit 14 - Exploring Wall and Floor Tiling Principles and Techniques"},{"$f":"IF(COUNTIF('Extended Certificate'!$G$21:$G$29,M11)>=1,\"\",ROW())","v":11},"Unit 14 - Exploring Wall and Floor Tiling Principles and Techniques",null,null,null,null,null,"Unit 14 - Vehicle Engines and Other Systems",{"$f":"IF(COUNTIF('Extended Certificate'!$G$21:$G$29,U11)>=1,\"\",ROW())","v":11},"Unit 14 - Vehicle Engines and Other Systems",null,{"$f":"IF(Y20=1,\"\",\"Unit 14 - The Early Years Sector\")","v":"Unit 14 - The Early Years Sector"},{"$f":"IF(COUNTIF('Extended Certificate'!$G$21:$G$29,Y11)>=1,\"\",ROW())","v":11},"Unit 14 - The Early Years Sector",null,null,null,null,null,null,null,null,null,"Unit 13 - Website Development",{"$f":"IF(COUNTIF('Extended Certificate'!$G$21:$G$29,AK11)>=1,\"\",ROW())","v":11},"Unit 13 - Website Development",null,null,null,null,null,null,null,null,null,"Unit 18 - Jazz Dance Techniques",{"$f":"IF(COUNTIF('Extended Certificate'!$G$31:$G$37,AW11)>=1,\"\",ROW())","v":11},"Unit 18 - Jazz Dance Techniques",null,"Unit 18 - Jazz Dance Techniques",{"$f":"IF(COUNTIF(Certificate!$G$23:$G$25,BA11)>=1,\"\",ROW())","v":11},"Unit 18 - Jazz Dance Techniques",null,null,null,null,null,null,null,null,null,null,null,null,null,null,null,null,null,null,null,null,null,null,null,null,null,null,null,null,null,null,null,null,null,"Unit 24 - Lighting for Performance",{"$f":"IF(COUNTIF(Certificate!$G$23:$G$25,CK11)>=1,\"\",ROW())","v":11},"Unit 24 - Lighting for Performance",null,"Unit 29 - Wardrobe for Stage Performance",{"$f":"IF(COUNTIF('Extended Certificate'!$G$21:$G$29,CO11)>=1,\"\",ROW())","v":11},"Unit 29 - Wardrobe for Stage Performance",null,null,null,null,null,"Unit 13 - Profiling Sports Performance",{"$f":"IF(COUNTIF('Extended Certificate'!$G$21:$G$29,CW11)>=1,\"\",ROW())","v":11},"Unit 13 - Profiling Sports Performance",null,"Unit 19 - Hospitality Operations in the Travel and Tourism \nSector",{"$f":"IF(COUNTIF('Extended Certificate'!$G$21:$G$29,DA11)>=1,\"\",ROW())","v":11},"Unit 19 - Hospitality Operations in the Travel and Tourism \nSector",null,"Unit 18 - Lighting for Moving Image  ",{"$f":"IF(COUNTIF('Extended Certificate'!$G$31:$G$37,DE11)>=1,\"\",ROW())","v":11},{"$f":"IF(ROW(DE11)-ROW(DE$2)+1>COUNT(DF$2:DF$11),\"\",INDEX(DE:DE,SMALL(DF$2:DF$11,1+ROW(DE11)-ROW(DE$2))))","v":"Unit 18 - Lighting for Moving Image  "},null,null,null,null,null,null,null,null,null,{"$f":"IF(DQ15=1,\"\",\"Unit 22 - Designing Products\")","v":"Unit 22 - Designing Products"},{"$f":"IF(COUNTIF('Extended Certificate'!$G$21:$G$29,DQ11)>=1,\"\",ROW())","v":11},"Unit 22 - Designing Products",null,"Unit 19 - Digital Art and Design Briefs",{"$f":"IF(COUNTIF('Extended Certificate'!$G$21:$G$29,DU11)>=1,\"\",ROW())","v":11},"Unit 19 - Digital Art and Design Briefs",null,"Unit 19 - Digital Art and Design Briefs",{"$f":"IF(COUNTIF('Extended Certificate'!$G$21:$G$29,DY11)>=1,\"\",ROW())","v":11},"Unit 19 - Digital Art and Design Briefs",null,null,null,null,null,null,null,null,null,null,null,null,null,"Unit 22 - Exploring Music Improvisation",{"$f":"IF(COUNTIF('Extended Certificate'!$G$31:$G$37,EO11)>=1,\"\",ROW())","v":11},"Unit 22 - Exploring Music Improvisation",null,"Unit 18 - Designing and Making Useful Devices in Science",{"$f":"IF(COUNTIF('Extended Certificate'!$G$21:$G$29,ES11)>=1,\"\",ROW())","v":11},"Unit 18 - Designing and Making Useful Devices in Science",null,{"$f":"IF(EW20=1,\"\",\"Unit 14 - Multi-day Expedition Experience\")","v":"Unit 14 - Multi-day Expedition Experience"},{"$f":"IF(COUNTIF('Extended Certificate'!$G$21:$G$29,EW11)>=1,\"\",ROW())","v":11},"Unit 14 - Multi-day Expedition Experience"]
["Unit 15 - Designing for the Future",{"$f":"IF(COUNTIF('Extended Certificate'!$G$21:$G$29,A12)>=1,\"\",ROW())","v":12},"Unit 15 - Designing for the Future",null,{"$f":"IF(AND(E23=0,E26=1),\"\",\"Unit 14 - Business Online\")","v":"Unit 14 - Business Online"},{"$f":"IF(COUNTIF('Extended Certificate'!$G$21:$G$29,E12)>=1,\"\",ROW())","v":12},"Unit 14 - Business Online",null,null,null,null,null,{"$f":"IF(OR(P20=1,P23=1,P26=1,P29=1,P32=1),\"\",\"Unit 15 - Exploring Plastering and Dry Lining Principles and Techniques\")","v":"Unit 15 - Exploring Plastering and Dry Lining Principles and Techniques"},{"$f":"IF(COUNTIF('Extended Certificate'!$G$21:$G$29,M12)>=1,\"\",ROW())","v":12},"Unit 15 - Exploring Plastering and Dry Lining Principles and Techniques",null,null,null,null,null,"Unit 15 - Operating an Efficient Workplace",{"$f":"IF(COUNTIF('Extended Certificate'!$G$21:$G$29,U12)>=1,\"\",ROW())","v":12},{"$f":"IF(ROW(U12)-ROW(U$2)+1>COUNT(V$2:V$17),\"\",INDEX(U:U,SMALL(V$2:V$17,1+ROW(U12)-ROW(U$2))))","v":"Unit 15 - Operating an Efficient Workplace"},null,null,null,null,null,null,null,null,null,null,null,null,null,"Unit 14 - Installing and Maintaining Computer Hardware",{"$f":"IF(COUNTIF('Extended Certificate'!$G$21:$G$29,AK12)>=1,\"\",ROW())","v":12},"Unit 14 - Installing and Maintaining Computer Hardware",null,null,null,null,null,null,null,null,null,"Unit 19 - Design Planning for Performance",{"$f":"IF(COUNTIF('Extended Certificate'!$G$31:$G$37,AW12)>=1,\"\",ROW())","v":12},"Unit 19 - Design Planning for Performance",null,"Unit 19 - Design Planning for Performance",{"$f":"IF(COUNTIF(Certificate!$G$23:$G$25,BA12)>=1,\"\",ROW())","v":12},"Unit 19 - Design Planning for Performance",null,null,null,null,null,null,null,null,null,null,null,null,null,null,null,null,null,null,null,null,null,null,null,null,null,null,null,null,null,null,null,null,null,"Unit 25 - Sound for Performance",{"$f":"IF(COUNTIF(Certificate!$G$23:$G$25,CK12)>=1,\"\",ROW())","v":12},"Unit 25 - Sound for Performance",null,null,null,null,null,null,null,null,null,null,null,null,null,"Unit 20 - UK Visitor Attractions",{"$f":"IF(COUNTIF('Extended Certificate'!$G$21:$G$29,DA12)>=1,\"\",ROW())","v":12},"Unit 20 - UK Visitor Attractions",null,null,null,null,null,null,null,null,null,null,null,null,null,null,null,null,null,"Unit 20 - Interactive Media Production Briefs",{"$f":"IF(COUNTIF('Extended Certificate'!$G$21:$G$29,DU12)>=1,\"\",ROW())","v":12},"Unit 20 - Interactive Media Production Briefs",null,"Unit 20 - Interactive Media Production Briefs",{"$f":"IF(COUNTIF('Extended Certificate'!$G$21:$G$29,DY12)>=1,\"\",ROW())","v":12},"Unit 20 - Interactive Media Production Briefs",null,null,null,null,null,null,null,null,null,null,null,null,null,"Unit 23 - Exploring Djing",{"$f":"IF(COUNTIF('Extended Certificate'!$G$31:$G$37,EO12)>=1,\"\",ROW())","v":12},{"$f":"IF(ROW(EO12)-ROW(EO$2)+1>COUNT(EP$2:EP$12),\"\",INDEX(EO:EO,SMALL(EP$2:EP$12,1+ROW(EO12)-ROW(EO$2))))","v":"Unit 23 - Exploring Djing"},null,"Unit 19 - Chemical Analysis and Detection ",{"$f":"IF(COUNTIF('Extended Certificate'!$G$21:$G$29,ES12)>=1,\"\",ROW())","v":12},"Unit 19 - Chemical Analysis and Detection ",null,"Unit 15 - Health and Safety in the Public Services",{"$f":"IF(COUNTIF('Extended Certificate'!$G$21:$G$29,EW12)>=1,\"\",ROW())","v":12},"Unit 15 - Health and Safety in the Public Services"]
["Unit 16 - Applying Contextual References in Art and Design",{"$f":"IF(COUNTIF('Extended Certificate'!$G$21:$G$29,A13)>=1,\"\",ROW())","v":13},"Unit 16 - Applying Contextual References in Art and Design",null,{"$f":"IF(AND(E23=0,E26=1),\"\",\"Unit 15 - Public Sector Business\")","v":"Unit 15 - Public Sector Business"},{"$f":"IF(COUNTIF('Extended Certificate'!$G$21:$G$29,E13)>=1,\"\",ROW())","v":13},"Unit 15 - Public Sector Business",null,null,null,null,null,{"$f":"IF(OR(P23=1,P26=1,P29=1,P32=1),\"\",\"Unit 16 - Carpentry and Joinery Operations\")","v":"Unit 16 - Carpentry and Joinery Operations"},{"$f":"IF(COUNTIF('Extended Certificate'!$G$21:$G$29,M13)>=1,\"\",ROW())","v":13},"Unit 16 - Carpentry and Joinery Operations",null,null,null,null,null,"Unit 16 - Vehicle Electrical Systems",{"$f":"IF(COUNTIF('Extended Certificate'!$G$21:$G$29,U13)>=1,\"\",ROW())","v":13},"Unit 16 - Vehicle Electrical Systems",null,null,null,null,null,"Unit 4",null,"Unit 16","Forbidden",null,null,null,null,"Unit 15 - Installing and Maintaining Computer Software",{"$f":"IF(COUNTIF('Extended Certificate'!$G$21:$G$29,AK13)>=1,\"\",ROW())","v":13},"Unit 15 - Installing and Maintaining Computer Software",null,null,null,null,null,null,null,null,null,"Unit 20 - Realising Costume Design for Performance",{"$f":"IF(COUNTIF('Extended Certificate'!$G$31:$G$37,AW13)>=1,\"\",ROW())","v":13},"Unit 20 - Realising Costume Design for Performance",null,"Unit 20 - Realising Costume Design for Performance",{"$f":"IF(COUNTIF(Certificate!$G$23:$G$25,BA13)>=1,\"\",ROW())","v":13},"Unit 20 - Realising Costume Design for Performance",null,null,null,null,null,null,null,null,null,null,null,null,null,null,null,null,null,null,null,null,null,null,null,null,null,null,null,null,null,null,null,null,null,"Unit 28 - Make-up for Performance",{"$f":"IF(COUNTIF(Certificate!$G$23:$G$25,CK13)>=1,\"\",ROW())","v":13},"Unit 28 - Make-up for Performance",null,null,null,null,null,null,null,null,null,null,null,null,null,null,null,null,null,null,null,null,null,"Unit 3",null,null,null,null,null,null,null,null,null,null,null,null,null,null,null,null,null,null,null,null,null,null,null,null,null,null,null,null,null,null,null,null,null,null,null,"Unit 20 - Exploring our Universe ",{"$f":"IF(COUNTIF('Extended Certificate'!$G$21:$G$29,ES13)>=1,\"\",ROW())","v":13},"Unit 20 - Exploring our Universe ",null,"Unit 16 - Employability Skills in the Public Services",{"$f":"IF(COUNTIF('Extended Certificate'!$G$21:$G$29,EW13)>=1,\"\",ROW())","v":13},"Unit 16 - Employability Skills in the Public Services"]
["Unit 17 - Art, Craft and Design in the Creative Industries",{"$f":"IF(COUNTIF('Extended Certificate'!$G$21:$G$29,A14)>=1,\"\",ROW())","v":14},"Unit 17 - Art, Craft and Design in the Creative Industries",null,"Unit 16 - Enhancing the Customer Experience",{"$f":"IF(COUNTIF('Extended Certificate'!$G$21:$G$29,E14)>=1,\"\",ROW())","v":14},"Unit 16 - Enhancing the Customer Experience",null,null,null,null,null,{"$f":"IF(OR(P20=1,P26=1,P29=1,P32=1),\"\",\"Unit 17 - Brickwork and Blockwork Operations\")","v":"Unit 17 - Brickwork and Blockwork Operations"},{"$f":"IF(COUNTIF('Extended Certificate'!$G$21:$G$29,M14)>=1,\"\",ROW())","v":14},"Unit 17 - Brickwork and Blockwork Operations",null,null,null,null,null,"Unit 17 - Welding",{"$f":"IF(COUNTIF('Extended Certificate'!$G$21:$G$29,U14)>=1,\"\",ROW())","v":14},"Unit 17 - Welding",null,null,null,null,null,{"$f":"COUNTIF('Extended Certificate'!$G$21:$G$29, \"Unit 4 - Costing and Controlling Finances in the Hospitality Industry\")","v":0},null,{"$f":"COUNTIF('Extended Certificate'!$G$31:$G$33, \"Unit 16 - Managing Finance in Hospitality\")","v":0},{"$f":"IF(AND(AC14=0,AE14=1),1,0)","v":0},null,null,null,null,"Unit 16 - Automated Computer Systems",{"$f":"IF(COUNTIF('Extended Certificate'!$G$21:$G$29,AK14)>=1,\"\",ROW())","v":14},"Unit 16 - Automated Computer Systems",null,null,null,null,null,null,null,null,null,"Unit 21 - Realising Set Design for Performance",{"$f":"IF(COUNTIF('Extended Certificate'!$G$31:$G$37,AW14)>=1,\"\",ROW())","v":14},"Unit 21 - Realising Set Design for Performance",null,"Unit 21 - Realising Set Design for Performance",{"$f":"IF(COUNTIF(Certificate!$G$23:$G$25,BA14)>=1,\"\",ROW())","v":14},"Unit 21 - Realising Set Design for Performance",null,null,null,null,null,null,null,null,null,null,null,null,null,null,null,null,null,null,null,null,null,null,null,null,null,null,null,null,null,null,null,null,null,"Unit 29 - Wardrobe for Stage Performance",{"$f":"IF(COUNTIF(Certificate!$G$23:$G$25,CK14)>=1,\"\",ROW())","v":14},"Unit 29 - Wardrobe for Stage Performance",null,null,null,null,null,null,null,null,null,null,null,null,null,"Done",null,null,null,null,null,null,null,{"$f":"COUNTIF('Extended Certificate'!$G$21:$G$29, \"Unit 3 - Communicating Ideas in 2D\")","v":0},null,null,null,null,null,null,null,"Unit 4",null,null,null,"Unit 3",null,null,null,null,null,null,null,null,null,null,null,null,null,null,null,null,null,null,null,null,null,null,null,"Unit 21 - Electronics in Action",{"$f":"IF(COUNTIF('Extended Certificate'!$G$21:$G$29,ES14)>=1,\"\",ROW())","v":14},"Unit 21 - Electronics in Action",null,"Unit 17 - Preparing to Respond to Emergency Incidents",{"$f":"IF(COUNTIF('Extended Certificate'!$G$21:$G$29,EW14)>=1,\"\",ROW())","v":14},"Unit 17 - Preparing to Respond to Emergency Incidents"]
[{"$f":"IF(A26=1,\"\",\"Unit 18 - 3D Design Briefs\")","v":"Unit 18 - 3D Design Briefs"},{"$f":"IF(COUNTIF('Extended Certificate'!$G$21:$G$29,A15)>=1,\"\",ROW())","v":15},"Unit 18 - 3D Design Briefs",null,{"$f":"IF(AND(E23=0,E26=1),\"\",\"Unit 17 - Visual Merchandising in Retail Business\")","v":"Unit 17 - Visual Merchandising in Retail Business"},{"$f":"IF(COUNTIF('Extended Certificate'!$G$21:$G$29,E15)>=1,\"\",ROW())","v":15},"Unit 17 - Visual Merchandising in Retail Business",null,null,null,null,null,{"$f":"IF(OR(P20=1,P23=1,P29=1,P32=1),\"\",\"Unit 18 - Painting and Paperhanging Operations\")","v":"Unit 18 - Painting and Paperhanging Operations"},{"$f":"IF(COUNTIF('Extended Certificate'!$G$21:$G$29,M15)>=1,\"\",ROW())","v":15},"Unit 18 - Painting and Paperhanging Operations",null,null,null,null,null,"Unit 18 - Computer Numerical Control Programming",{"$f":"IF(COUNTIF('Extended Certificate'!$G$21:$G$29,U15)>=1,\"\",ROW())","v":15},"Unit 18 - Computer Numerical Control Programming",null,null,null,null,null,null,null,null,null,null,null,null,null,"Unit 17 - Multimedia Products Development",{"$f":"IF(COUNTIF('Extended Certificate'!$G$21:$G$29,AK15)>=1,\"\",ROW())","v":15},"Unit 17 - Multimedia Products Development",null,null,null,null,null,null,null,null,null,"Unit 22 - Realising Prop Design for Performance",{"$f":"IF(COUNTIF('Extended Certificate'!$G$31:$G$37,AW15)>=1,\"\",ROW())","v":15},"Unit 22 - Realising Prop Design for Performance",null,"Unit 22 - Realising Prop Design for Performance",{"$f":"IF(COUNTIF(Certificate!$G$23:$G$25,BA15)>=1,\"\",ROW())","v":15},"Unit 22 - Realising Prop Design for Performance",null,null,null,null,null,null,null,null,null,null,null,null,null,null,null,null,null,null,null,null,null,null,null,null,null,null,null,null,null,null,null,null,null,null,null,null,null,null,null,null,null,null,null,null,null,null,null,null,null,null,null,null,null,null,null,null,null,null,null,null,null,null,null,null,null,{"$f":"COUNTIF('Extended Certificate'!$G$21:$G$29, \"Unit 4 - Communicating Ideas in 3D\")","v":0},null,null,null,{"$f":"COUNTIF('Extended Certificate'!$G$21:$G$29, \"Unit 3 - Communicating Ideas in 2D\")","v":0},null,null,null,null,null,null,null,null,null,null,null,null,null,null,null,null,null,null,null,null,null,null,null,"Unit 22 - Biotechnology Procedures and Applications",{"$f":"IF(COUNTIF('Extended Certificate'!$G$21:$G$29,ES15)>=1,\"\",ROW())","v":15},"Unit 22 - Biotechnology Procedures and Applications",null,"Unit 18 - Security Procedures in the Public Services",{"$f":"IF(COUNTIF('Extended Certificate'!$G$21:$G$29,EW15)>=1,\"\",ROW())","v":15},"Unit 18 - Security Procedures in the Public Services"]
["Unit 19 - Digital Art and Design Briefs",{"$f":"IF(COUNTIF('Extended Certificate'!$G$21:$G$29,A16)>=1,\"\",ROW())","v":16},"Unit 19 - Digital Art and Design Briefs",null,null,null,null,null,null,null,null,null,{"$f":"IF(OR(P20=1,P23=1,P26=1,P32=1),\"\",\"Unit 19 - Plumbing Operations\")","v":"Unit 19 - Plumbing Operations"},{"$f":"IF(COUNTIF('Extended Certificate'!$G$21:$G$29,M16)>=1,\"\",ROW())","v":16},"Unit 19 - Plumbing Operations",null,null,null,null,null,"Unit 19 - Bicycle Servicing and Maintenance",{"$f":"IF(COUNTIF('Extended Certificate'!$G$21:$G$29,U16)>=1,\"\",ROW())","v":16},"Unit 19 - Bicycle Servicing and Maintenance",null,null,null,null,null,"Unit 6",null,"Unit 13",null,null,null,null,null,null,null,null,null,null,null,null,null,null,null,null,null,"Unit 23 - Realising Mask Design for Performance",{"$f":"IF(COUNTIF('Extended Certificate'!$G$31:$G$37,AW16)>=1,\"\",ROW())","v":16},"Unit 23 - Realising Mask Design for Performance",null,"Unit 23 - Realising Mask Design for Performance",{"$f":"IF(COUNTIF(Certificate!$G$23:$G$25,BA16)>=1,\"\",ROW())","v":16},"Unit 23 - Realising Mask Design for Performance",null,null,null,null,null,null,null,null,null,null,null,null,null,null,null,null,null,null,null,null,null,null,null,null,null,null,null,null,null,null,null,null,null,null,null,null,null,null,null,null,null,null,null,null,null,null,null,null,null,null,null,null,null,null,null,null,null,"Unit 21",null,null,null,null,null,null,null,null,null,null,null,null,null,null,null,null,null,null,null,null,null,null,null,null,null,null,null,null,null,null,null,null,null,null,null,"Unit 23 - Further Chemistry ",{"$f":"IF(COUNTIF('Extended Certificate'!$G$21:$G$29,ES16)>=1,\"\",ROW())","v":16},"Unit 23 - Further Chemistry "]
["Unit 20 - Interactive Media Production Briefs",{"$f":"IF(COUNTIF('Extended Certificate'!$G$21:$G$29,A17)>=1,\"\",ROW())","v":17},"Unit 20 - Interactive Media Production Briefs",null,null,null,null,null,null,null,null,null,{"$f":"IF(OR(P20=1,P23=1,P26=1,P29=1),\"\",\"Unit 20 - Electrical Operations\")","v":"Unit 20 - Electrical Operations"},{"$f":"IF(COUNTIF('Extended Certificate'!$G$21:$G$29,M17)>=1,\"\",ROW())","v":17},"Unit 20 - Electrical Operations",null,null,null,null,null,"Unit 20 - Sustainable Vehicle Power and Structure Design",{"$f":"IF(COUNTIF('Extended Certificate'!$G$21:$G$29,U17)>=1,\"\",ROW())","v":17},"Unit 20 - Sustainable Vehicle Power and Structure Design",null,null,null,null,null,{"$f":"COUNTIF('Extended Certificate'!$G$21:$G$29, \"Unit 6 - Planning, Preparing, Cooking and Finishing Food\")","v":0},null,{"$f":"COUNTIF('Extended Certificate'!$G$31:$G$33, \"Unit 13 - Contemporary World Food Cooking Skills\")","v":0},{"$f":"IF(AND(AC17=0,AE17=1),1,0)","v":0},null,null,null,null,null,null,null,null,null,null,null,null,null,null,null,null,"Unit 24 - Lighting for Performance",{"$f":"IF(COUNTIF('Extended Certificate'!$G$31:$G$37,AW17)>=1,\"\",ROW())","v":17},"Unit 24 - Lighting for Performance",null,"Unit 24 - Lighting for Performance",{"$f":"IF(COUNTIF(Certificate!$G$23:$G$25,BA17)>=1,\"\",ROW())","v":17},"Unit 24 - Lighting for Performance",null,null,null,null,null,null,null,null,null,null,null,null,null,null,null,null,null,null,null,null,null,null,null,null,null,null,null,null,null,null,null,null,null,null,null,null,null,null,null,null,null,null,null,null,null,null,null,null,null,null,null,null,null,null,null,null,null,{"$f":"COUNTIF('Extended Certificate'!$G$21:$G$29, \"Unit 21 - Painting Briefs\")","v":0},null,null,null,null,null,null,null,"Unit 22",null,null,null,"Unit 11",null,null,null,null,null,null,null,null,null,null,null,null,null,null,null,null,null,null,null,null,null,null,null,"Unit 24 - Further Physics",{"$f":"IF(COUNTIF('Extended Certificate'!$G$21:$G$29,ES17)>=1,\"\",ROW())","v":17},{"$f":"IF(ROW(ES17)-ROW(ES$2)+1>COUNT(ET$2:ET$17),\"\",INDEX(ES:ES,SMALL(ET$2:ET$17,1+ROW(ES17)-ROW(ES$2))))","v":"Unit 24 - Further Physics"}]
[{"$f":"IF(A23=1,\"\",\"Unit 21 - Painting Briefs\")","v":"Unit 21 - Painting Briefs"},{"$f":"IF(COUNTIF('Extended Certificate'!$G$21:$G$29,A18)>=1,\"\",ROW())","v":18},"Unit 21 - Painting Briefs",null,null,null,null,null,null,null,null,null,null,null,null,null,null,null,null,null,null,null,null,null,null,null,null,null,null,null,null,null,null,null,null,null,null,null,null,null,null,null,null,null,null,null,null,null,"Unit 25 - Sound for Performance",{"$f":"IF(COUNTIF('Extended Certificate'!$G$31:$G$37,AW18)>=1,\"\",ROW())","v":18},"Unit 25 - Sound for Performance",null,"Unit 25 - Sound for Performance",{"$f":"IF(COUNTIF(Certificate!$G$23:$G$25,BA18)>=1,\"\",ROW())","v":18},"Unit 25 - Sound for Performance",null,null,null,null,null,null,null,null,null,null,null,null,null,null,null,null,null,null,null,null,null,null,null,null,null,null,null,null,null,null,null,null,null,null,null,null,null,null,null,null,null,null,null,null,null,null,null,null,null,null,null,null,null,null,null,null,null,null,null,null,null,null,null,null,null,{"$f":"COUNTIF('Extended Certificate'!$G$21:$G$29, \"Unit 22 - Designing Products\")","v":0},null,null,null,{"$f":"COUNTIF('Extended Certificate'!$G$21:$G$29, \"Unit 11 - Graphic Design Briefs\")","v":0}]
[{"$f":"IF(A26=1,\"\",\"Unit 22 - Designing Products\")","v":"Unit 22 - Designing Products"},{"$f":"IF(COUNTIF('Extended Certificate'!$G$21:$G$29,A19)>=1,\"\",ROW())","v":19},{"$f":"IF(ROW(A19)-ROW(A$2)+1>COUNT(B$2:B$19),\"\",INDEX(A:A,SMALL(B$2:B$19,1+ROW(A19)-ROW(A$2))))","v":"Unit 22 - Designing Products"},null,null,null,null,null,null,null,null,null,"Unit 6",null,"Unit 16","Forbidden?",null,null,null,null,null,null,null,null,"Unit 13",null,null,null,null,null,null,null,null,null,null,null,null,null,null,null,null,null,null,null,null,null,null,null,"Unit 26 - Supporting Performance: Stage Management",{"$f":"IF(COUNTIF('Extended Certificate'!$G$31:$G$37,AW19)>=1,\"\",ROW())","v":19},"Unit 26 - Supporting Performance: Stage Management",null,"Unit 26 - Supporting Performance: Stage Management",{"$f":"IF(COUNTIF(Certificate!$G$23:$G$25,BA19)>=1,\"\",ROW())","v":19},"Unit 26 - Supporting Performance: Stage Management",null,null,null,null,null,null,null,null,null,null,null,null,null,null,null,null,null,null,null,null,null,null,null,null,null,null,null,null,null,null,null,null,null,null,null,null,null,null,null,null,null,null,null,null,null,null,null,null,null,null,null,null,null,null,null,null,null,null,null,null,null,null,null,null,null,null,null,null,null,null,null,null,null,null,null,null,null,null,null,null,null,null,null,null,null,null,null,null,null,null,null,null,null,"Done",null,null,null,"Unit 10"]
[null,null,null,null,null,null,null,null,null,null,null,null,{"$f":"COUNTIF('Extended Certificate'!$G$21:$G$29, \"Unit 6 - Exploring Carpentry and Joinery Principles and Techniques\")","v":0},null,{"$f":"COUNTIF('Extended Certificate'!$G$21:$G$29, \"Unit 16 - Carpentry and Joinery Operations\")","v":0},{"$f":"IF(AND(M20=0,O20=1),1,0)","v":0},null,null,null,null,null,null,null,null,{"$f":"COUNTIF('Extended Certificate'!$G$21:$G$29, \"Unit 13 - The Health and Social Care Sector\")","v":0},null,null,null,null,null,null,null,null,null,null,null,null,null,null,null,null,null,null,null,null,null,null,null,"Unit 27 - Supporting Performance: Front of House",{"$f":"IF(COUNTIF('Extended Certificate'!$G$31:$G$37,AW20)>=1,\"\",ROW())","v":20},"Unit 27 - Supporting Performance: Front of House",null,"Unit 27 - Supporting Performance: Front of House",{"$f":"IF(COUNTIF(Certificate!$G$23:$G$25,BA20)>=1,\"\",ROW())","v":20},"Unit 27 - Supporting Performance: Front of House",null,null,null,null,null,null,null,null,null,null,null,null,null,null,null,null,null,null,null,null,null,null,null,null,null,null,null,null,null,null,null,null,null,null,null,null,null,null,null,null,null,null,null,null,null,null,null,null,null,null,null,null,null,null,null,null,null,null,null,null,null,null,null,null,null,null,null,null,null,null,null,null,null,null,null,null,null,null,null,null,null,null,null,null,null,null,null,null,null,null,null,null,null,null,null,null,null,{"$f":"COUNTIF('Extended Certificate'!$G$21:$G$29, \"Unit 10 - Adventurous Activities in the Public Services\")","v":0}]
[null,null,null,null,null,null,null,null,null,null,null,null,null,null,null,null,null,null,null,null,null,null,null,null,null,null,null,null,null,null,null,null,null,null,null,null,null,null,null,null,null,null,null,null,null,null,null,null,"Unit 28 - Make-up for Performance",{"$f":"IF(COUNTIF('Extended Certificate'!$G$31:$G$37,AW21)>=1,\"\",ROW())","v":21},"Unit 28 - Make-up for Performance",null,"Unit 28 - Make-up for Performance",{"$f":"IF(COUNTIF(Certificate!$G$23:$G$25,BA21)>=1,\"\",ROW())","v":21},"Unit 28 - Make-up for Performance"]
["Unit 3",null,null,null,"Unit 4",null,null,null,null,null,null,null,"Unit 7",null,"Unit 17",null,null,null,null,null,null,null,null,null,"Unit 14",null,null,null,null,null,null,null,null,null,null,null,null,null,null,null,null,null,null,null,null,null,null,null,"Unit 29 - Wardrobe for Stage Performance",{"$f":"IF(COUNTIF('Extended Certificate'!$G$31:$G$37,AW22)>=1,\"\",ROW())","v":22},"Unit 29 - Wardrobe for Stage Performance",null,"Unit 29 - Wardrobe for Stage Performance",{"$f":"IF(COUNTIF(Certificate!$G$23:$G$25,BA22)>=1,\"\",ROW())","v":22},"Unit 29 - Wardrobe for Stage Performance",null,null,null,null,null,null,null,null,null,null,null,null,null,null,null,null,null,null,null,null,null,null,null,null,null,null,null,null,null,null,null,null,null,null,null,null,null,null,null,null,null,null,null,null,null,null,null,null,null,null,null,null,null,null,null,null,null,null,null,null,null,null,null,null,null,null,null,null,null,null,null,null,null,null,null,null,null,null,null,null,null,null,null,null,null,null,null,null,null,null,null,null,null,null,null,null,null,"Unit 14"]
[{"$f":"COUNTIF('Extended Certificate'!$G$21:$G$29, \"Unit 3 - Communicating Ideas in 2D\")","v":0},null,null,null,{"$f":"COUNTIF('Extended Certificate'!$G$21:$G$29, \"Unit 4 - Principles of Customer Service\")","v":0},null,null,null,null,null,null,null,{"$f":"COUNTIF('Extended Certificate'!$G$21:$G$29, \"Unit 7 - Exploring Brickwork and Blockwork Principles and Techniques\")","v":0},null,{"$f":"COUNTIF('Extended Certificate'!$G$21:$G$29, \"Unit 17 - Brickwork and Blockwork Operations\")","v":0},{"$f":"IF(AND(M23=0,O23=1),1,0)","v":0},null,null,null,null,null,null,null,null,{"$f":"COUNTIF('Extended Certificate'!$G$21:$G$29, \"Unit 14 - The Early Years Sector\")","v":0},null,null,null,null,null,null,null,null,null,null,null,null,null,null,null,null,null,null,null,null,null,null,null,null,null,null,null,null,null,null,null,null,null,null,null,null,null,null,null,null,null,null,null,null,null,null,null,null,null,null,null,null,null,null,null,null,null,null,null,null,null,null,null,null,null,null,null,null,null,null,null,null,null,null,null,null,null,null,null,null,null,null,null,null,null,null,null,null,null,null,null,null,null,null,null,null,null,null,null,null,null,null,null,null,null,null,null,null,null,null,null,null,null,null,null,null,null,null,null,null,null,null,null,null,null,null,null,{"$f":"COUNTIF('Extended Certificate'!$G$21:$G$29, \"Unit 14 - Multi-day Expedition Experience\")","v":0}]
[]
["Unit 4",null,null,null,"Unit 16",null,null,null,null,null,null,null,"Unit 8",null,"Unit 18"]
[{"$f":"COUNTIF('Extended Certificate'!$G$21:$G$29, \"Unit 4 - Communicating Ideas in 3D\")","v":0},null,null,null,{"$f":"COUNTIF('Extended Certificate'!$G$21:$G$29, \"Unit 16 - Enhancing the Customer Experience\")","v":0},null,null,null,null,null,null,null,{"$f":"COUNTIF('Extended Certificate'!$G$21:$G$29, \"Unit 8 - Exploring Painting and Decorating Principles and Techniques\")","v":0},null,{"$f":"COUNTIF('Extended Certificate'!$G$21:$G$29, \"Unit 18 - Painting and Paperhanging Operations\")","v":0},0]
[null,null,null,null,null,null,null,null,null,null,null,null,null,null,null,null,null,null,null,null,null,null,null,null," "]
["Unit 9",null,null,null,null,null,null,null,null,null,null,null,"Unit 9",null,"Unit 19"]
[{"$f":"COUNTIF('Extended Certificate'!$G$21:$G$29, \"Unit 9 - Design Crafts Briefs\")","v":0},null,null,null,null,null,null,null,null,null,null,null,{"$f":"COUNTIF('Extended Certificate'!$G$21:$G$29, \"Unit 9 - Exploring Plumbing Principles and Techniques\")","v":0},null,{"$f":"COUNTIF('Extended Certificate'!$G$21:$G$29, \"Unit 19 - Plumbing Operations\")","v":0},0]
[]
["Unit 11",null,null,null,null,null,null,null,null,null,null,null,"Unit 10",null,"Unit 20"]
[{"$f":"COUNTIF('Extended Certificate'!$G$21:$G$29, \"Unit 11 - Graphic Design Briefs\")","v":0},null,null,null,null,null,null,null,null,null,null,null,{"$f":"COUNTIF('Extended Certificate'!$G$21:$G$29, \"Unit 10 - Exploring Electrical Principles and Techniques\")","v":0},null,{"$f":"COUNTIF('Extended Certificate'!$G$21:$G$29, \"Unit 20 - Electrical Operations\")","v":0},0]
[]
["Unit 13"]
[{"$f":"COUNTIF('Extended Certificate'!$G$21:$G$29, \"Unit 13 - Visual Arts Briefs\")","v":0}]
[]
["Unit 18"]
[{"$f":"COUNTIF('Extended Certificate'!$G$21:$G$29, \"Unit 18 - 3D Design Briefs\")","v":0}]
[]
["Unit 21"]
[{"$f":"COUNTIF('Extended Certificate'!$G$21:$G$29, \"Unit 21 - Painting Briefs\")","v":0}]
[]
["Unit 22"]
[{"$f":"COUNTIF('Extended Certificate'!$G$21:$G$29, \"Unit 22 - Designing Products\")","v":0}]

{"sheet":"Diploma Unit Data","index":13,"n_rows":356,"n_cols":24,"rows_kept":356,"cut":false,"hidden":true,"merged":[]}
["Core Units",null,null,null,null,"Core 2",null,null,null,null,"Core 3",null,null,null,null,"Mandatory Units",null,null,null,null,"Diploma Units"]
["Sector","Unit Name","GLH",null,null,"Sector","Unit Name","GLH",null,null,"Sector","Unit Name","GLH",null,null,"Sector","Unit Name","GLH",null,null,"Sector","Unit Name","GLH"]
["Art and Design","Unit 1 - Introduction to Specialist Pathways in Art and Design",30,"Internal",null,"Art and Design","Unit 2 - Creative Project in Art and Design",30,"External",null,"Art and Design","Unit 23 - Practical Research Project in Art and Design",60,"External",null,"Art and Design","Unit 5 - Developing an Art and Design Portfolio",30,"Internal",null,"Art and Design","Unit 3 - Communicating Ideas in 2D",30,"Internal"]
["Art and Design Design Crafts","Unit 1 - Introduction to Specialist Pathways in Art and Design",30,"Internal",null,"Art and Design Design Crafts","Unit 2 - Creative Project in Art and Design",30,"External",null,"Art and Design Design Crafts","Unit 23 - Practical Research Project in Art and Design",60,"Internal",null,"Art and Design Design Crafts","Unit 5 - Developing an Art and Design Portfolio",30,"Internal",null,"Art and Design","Unit 4 - Communicating Ideas in 3D",30,"Internal"]
["Art and Design Fashion and Textiles","Unit 1 - Introduction to Specialist Pathways in Art and Design",30,"Internal",null,"Art and Design Fashion and Textiles","Unit 2 - Creative Project in Art and Design",30,"External",null,"Art and Design Fashion and Textiles","Unit 23 - Practical Research Project in Art and Design",60,"Internal",null,"Art and Design Fashion and Textiles","Unit 5 - Developing an Art and Design Portfolio",30,"Internal",null,"Art and Design","Unit 5 - Developing an Art and Design Portfolio",30,"Internal"]
["Art and Design Photography","Unit 1 - Introduction to Specialist Pathways in Art and Design",30,"Internal",null,"Art and Design Photography","Unit 2 - Creative Project in Art and Design",30,"External",null,"Art and Design Photography","Unit 23 - Practical Research Project in Art and Design",60,"Internal",null,"Art and Design Photography","Unit 5 - Developing an Art and Design Portfolio",30,"Internal",null,"Art and Design","Unit 6 - Investigating Contextual References in Art and Design",30,"Internal"]
["Art and Design Product Design","Unit 1 - Introduction to Specialist Pathways in Art and Design",30,"Internal",null,"Art and Design Product Design","Unit 2 - Creative Project in Art and Design",30,"External",null,"Art and Design Product Design","Unit 23 - Practical Research Project in Art and Design",60,"Internal",null,"Art and Design Product Design","Unit 5 - Developing an Art and Design Portfolio",30,"Internal",null,"Art and Design","Unit 7 - Recording for Creative Intentions in Art and Design",30,"External"]
["Art and Design Visual Arts","Unit 1 - Introduction to Specialist Pathways in Art and Design",30,"Internal",null,"Art and Design Visual Arts","Unit 2 - Creative Project in Art and Design",30,"External",null,"Art and Design Visual Arts","Unit 23 - Practical Research Project in Art and Design",60,"Internal",null,"Art and Design Visual Arts","Unit 5 - Developing an Art and Design Portfolio",30,"Internal",null,"Art and Design","Unit 8 - Using Mobile Devices in Art and Design",30,"Internal"]
["Art and Design Visual Communication","Unit 1 - Introduction to Specialist Pathways in Art and Design",30,"Internal",null,"Art and Design Visual Communication","Unit 2 - Creative Project in Art and Design",30,"External",null,"Art and Design Visual Communication","Unit 23 - Practical Research Project in Art and Design",60,"Internal",null,"Art and Design Visual Communication","Unit 5 - Developing an Art and Design Portfolio",30,"Internal",null,"Art and Design","Unit 9 - Design Crafts Briefs",60,"Internal"]
["Business","Unit 1 - Enterprise in the Business World",30,"Internal",null,"Business","Unit 2 - Finance for Business",30,"External",null,"Business","Unit 18 - Small Business Planning",60,"Internal",null,"Business","Unit 3 - Promoting a Brand",30,"Internal",null,"Art and Design","Unit 10 - Fashion Briefs",60,"Internal"]
["CPLD","Unit 1 - Patterns of Child Development",30,"External",null,"CPLD","Unit 2 - Promoting Children’s Development Through Play",30,"Internal",null,"CPLD",null,null,null,null,"CPLD","Unit 3 - The Principles of Early Years Practice",60,"Internal",null,"Art and Design","Unit 11 - Graphic Design Briefs",60,"Internal"]
["Construction and the Built Environment","Unit 1 - Construction Technology ",30,"External",null,"Construction and the Built Environment","Unit 2 - Construction Technology ",30,"Internal",null,"Construction and the Built Environment","Unit 21 - Maintenance and Adaptation of Buildings",60,"Internal",null,"Construction and the Built Environment","Unit 3 - Scientific and Mathematical Applications for Construction",30,"Internal",null,"Art and Design","Unit 12 - Textiles Briefs",60,"Internal"]
["Creative Digital Media Production","Unit 1 - Digital Media Sectors and Audiences",30,"External",null,"Creative Digital Media Production","Unit 2 - Planning and Pitching a Digital Media Product ",30,"Internal",null,"Creative Digital Media Production","Unit 22 - Final Digital Production Project",60,"Internal",null,"Creative Digital Media Production","Unit 8 - Media Industry in Context",30,"External",null,"Art and Design","Unit 13 - Visual Arts Briefs",60,"Internal"]
["Engineering","Unit 1 - The Engineered World",30,"External",null,"Engineering","Unit 2 - Investigating an Engineered Product ",30,"Internal",null,"Engineering","Unit 21 - Introduction to Communications for Engineering",60,"Internal",null,"Engineering","Unit 3 - Health and Safety in Engineering",30,"Internal",null,"Art and Design","Unit 14 - Photography Briefs",60,"Internal"]
["Engineering Technology Pathway","Unit 1 - The Engineered World",30,"External",null,"Engineering Technology Pathway","Unit 2 - Investigating an Engineered Product ",30,"Internal",null,"Engineering Technology Pathway","Unit 21 - Introduction to Communications for Engineering",60,"Internal",null,"Engineering Technology Pathway","Unit 3 - Health and Safety in Engineering",30,"Internal"]
["Engineering Maintenance Pathway","Unit 1 - The Engineered World",30,"External",null,"Engineering Maintenance Pathway","Unit 2 - Investigating an Engineered Product ",30,"Internal",null,"Engineering Maintenance Pathway","Unit 21 - Introduction to Communications for Engineering",60,"Internal",null,"Engineering Maintenance Pathway","Unit 3 - Health and Safety in Engineering",30,"Internal"]
["Engineering Manufacturing Pathway","Unit 1 - The Engineered World",30,"External",null,"Engineering Manufacturing Pathway","Unit 2 - Investigating an Engineered Product ",30,"Internal",null,"Engineering Manufacturing Pathway","Unit 21 - Introduction to Communications for Engineering",60,"Internal",null,"Engineering Manufacturing Pathway","Unit 3 - Health and Safety in Engineering",30,"Internal"]
["Engineering Mechanical Pathway","Unit 1 - The Engineered World",30,"External",null,"Engineering Mechanical Pathway","Unit 2 - Investigating an Engineered Product ",30,"Internal",null,"Engineering Mechanical Pathway","Unit 21 - Introduction to Communications for Engineering",60,"Internal",null,"Engineering Mechanical Pathway","Unit 3 - Health and Safety in Engineering",30,"Internal"]
["Health and Social Care","Unit 1 - Human Lifespan Development",30,"External",null,"Health and Social Care","Unit 2 - Health and Social Care Values",30,"Internal",null,"Health and Social Care","Unit 15 - Carrying out a Research Project in Health and Social \nCare",60,"Internal",null,"Health and Social Care","Unit 3 - Effective Communication in Health and Social Care",30,"Internal",null,"Art and Design","Unit 15 - Designing for the Future",60,"Internal"]
["Hospitality","Unit 1 - Introducing the Hospitality Industry",30,"External",null,"Hospitality","Unit 2 - Working in the Hospitality Industry",30,"Internal",null,"Hospitality","Unit 18 - Delivering the Hospitality Customer Experience",60,"Internal",null,"Hospitality","Unit 3 - Food Safety and Health and Safety in Hospitality",30,"Internal",null,"Art and Design","Unit 16 - Applying Contextual References in Art and Design",30,"Internal"]
["Information and Creative Technology","Unit 1 - The Online World",30,"External",null,"Information and Creative Technology","Unit 2 - Technology Systems",30,"External",null,"Information and Creative Technology","Unit 3 - A Digital Portfolio",30,"Internal",null,"Information and Creative Technology","Unit 17 - Multimedia Products Development",60,"Internal",null,"Art and Design","Unit 17 - Art, Craft and Design in the Creative Industries",30,"Internal"]
["Information and Creative Technology Computer Science","Unit 1 - The Online World",30,"External",null,"Information and Creative Technology Computer Science","Unit 2 - Technology Systems",30,"External",null,"Information and Creative Technology Computer Science","Unit 3 - A Digital Portfolio",30,"Internal",null,"Information and Creative Technology Computer Science","Unit 12 - Software Development",60,"Internal"]
["Information and Creative Technology Systems Development and Support","Unit 1 - The Online World",30,"External",null,"Information and Creative Technology Systems Development and Support","Unit 2 - Technology Systems",30,"External",null,"Information and Creative Technology Systems Development and Support","Unit 3 - A Digital Portfolio",30,"Internal",null,"Information and Creative Technology Systems Development and Support","Unit 11 - Computer Networks",60,"Internal"]
["Music","Unit 1 - The Music Industry",30,"External",null,"Music","Unit 2 - Managing a Music Product ",30,"Internal",null,"Music","Unit 28 - Professional Skills in Music",60,"Internal",null,"Music","Unit 8 - Music and Production Analysis",30,"External",null,"Art and Design","Unit 18 - 3D Design Briefs",60,"Internal"]
["Performing Arts","Unit 1 - Individual Showcase ",30,"External",null,"Performing Arts","Unit 2 - Preparation, Performance and Production ",30,"Internal",null,"Performing Arts","Unit 31 - Community Arts",60,"Internal",null,"Performing Arts","Unit 8 - The Performing Arts Industry ",30,"External",null,"Art and Design","Unit 19 - Digital Art and Design Briefs",60,"Internal"]
["Performing Arts Acting","Unit 1 - Individual Showcase ",30,"External",null,"Performing Arts Acting","Unit 2 - Preparation, Performance and Production ",30,"Internal",null,"Performing Arts Acting","Unit 31 - Community Arts",60,"Internal",null,"Public Services","Unit 6 - Citizenship, Society and the Public Services",30,"External",null,"Art and Design","Unit 20 - Interactive Media Production Briefs",60,"Internal"]
["Performing Arts Dance","Unit 1 - Individual Showcase ",30,"External",null,"Performing Arts Dance","Unit 2 - Preparation, Performance and Production ",30,"Internal",null,"Performing Arts Dance","Unit 31 - Community Arts",60,"Internal",null,"Performing Arts Acting","Unit 3 - Acting Skills",60,"Internal",null,"Art and Design","Unit 21 - Painting Briefs",60,"Internal"]
["Performing Arts Musical Theatre","Unit 1 - Individual Showcase ",30,"External",null,"Performing Arts Musical Theatre","Unit 2 - Preparation, Performance and Production ",30,"Internal",null,"Performing Arts Musical Theatre","Unit 31 - Community Arts",60,"Internal",null,"Performing Arts Dance","Unit 4 - Dance Skills",60,"Internal",null,"Art and Design","Unit 22 - Designing Products",60,"Internal"]
["Performing Arts Production","Unit 1 - Individual Showcase ",30,"External",null,"Performing Arts Production","Unit 2 - Preparation, Performance and Production ",30,"Internal",null,"Performing Arts Production","Unit 31 - Community Arts",60,"Internal",null,"Performing Arts Musical Theatre","Unit 5 - Musical Theatre Skills",60,"Internal",null,"Art and Design","Unit 24 - Design Thinking",60,"Internal"]
["Sport","Unit 1 - Fitness for Sport and Exercise",30,"External",null,"Sport","Unit 2 - Practical Sports Performance ",30,"Internal",null,"Sport","Unit 14 - Carrying Out a Sports-related Project",60,"Internal",null,"Performing Arts Production","Unit 7 - Production Skills for Performance",60,"Internal",null,"Art and Design","Unit 25 - Fashion Promotion",60,"Internal"]
["Sport Outdoor and Adventurous Activities","Unit 1 - Fitness for Sport and Exercise",30,"External",null,"Sport Outdoor and Adventurous Activities","Unit 2 - Practical Sports Performance ",30,"Internal",null,"Sport Outdoor and Adventurous Activities","Unit 14 - Carrying Out a Sports-related Project",60,"Internal",null,"Sport","Unit 3 - The Mind and Sports Performance",30,"Internal",null,"Art and Design","Unit 26 - Moving Image Briefs",60,"Internal"]
["Sport Fitness and Exercise","Unit 1 - Fitness for Sport and Exercise",30,"External",null,"Sport Fitness and Exercise","Unit 2 - Practical Sports Performance ",30,"Internal",null,"Sport Fitness and Exercise","Unit 14 - Carrying Out a Sports-related Project",60,"Internal",null,"Sport Outdoor and Adventurous Activities","Unit 3 - The Mind and Sports Performance",30,"Internal",null,"Art and Design","Unit 27 - Interaction Design",60,"Internal"]
["Travel and Tourism","Unit 1 - The UK Travel and Tourism Sector",30,"External",null,"Travel and Tourism","Unit 2 - UK Travel and Tourism Destinations ",30,"Internal",null,"Travel and Tourism","Unit 11 - Delivering the Travel and Tourism Customer Experience ",60,"Internal",null,"Sport Fitness and Exercise","Unit 3 - The Mind and Sports Performance",30,"Internal",null,"Art and Design","Unit 28 - Printmaking Briefs",60,"Internal"]
["Public Services","Unit 1 - The Role and Work of the Public Services",30,"External",null,"Public Services","Unit 2 - Working Skills in the Public Service Sector",30,"Internal",null,"Public Services","Unit 19 - Carrying out a Project in Public Services",60,"Internal",null,"Travel and Tourism","Unit 3 - The Development of Travel and Tourism in the UK",30,"Internal",null,"Art and Design","Unit 29 - Drawing from Observation",60,"Internal"]
[null,null,null,null,null,null,null,null,null,null,null,null,null,null,null,"Applied Science","Unit 1 - Principles of Science",30,"External",null,"Art and Design","Unit 30 - Ceramics",60,"Internal"]
[null,null,null,null,null,null,null,null,null,null,null,null,null,null,null,null,null,null,null,null,"Art and Design","Unit 31 - Studio Photography",60,"Internal"]
[null,null,null,null,null,null,null,null,null,null,null,null,null,null,null,"Applied Science","Unit 2 - Chemistry and our Earth",30,"Internal",null,"Art and Design","Unit 32 - Location Photography",60,"Internal"]
["Core 4",null,null,null,null,null,null,null,null,null,null,null,null,null,null,"Art and Design","Unit 6 - Investigating Contextual References in Art and Design ",30,"Internal",null,"Art and Design","Unit 33 - Designing for Print and Screen",60,"Internal"]
["Unit","Title","GLH","Type",null,null,null,null,null,null,null,null,null,null,null,"Art and Design Design Crafts","Unit 6 - Investigating Contextual References in Art and Design ",30,"Internal",null,"Art and Design","Unit 34 - Editing Photographic Images",60,"Internal"]
["Information and Creative Technology","Unit 19 - Computing in the Workplace",60,"Internal",null,null,null,null,null,null,null,null,null,null,null,"Art and Design Fashion and Textiles","Unit 6 - Investigating Contextual References in Art and Design ",30,"Internal",null,"Art and Design","Unit 35 - Fashion Retail",60,"Internal"]
["Information and Creative Technology Computer Science","Unit 19 - Computing in the Workplace",60,"Internal",null,null,null,null,null,null,null,null,null,null,null,"Art and Design Photography","Unit 6 - Investigating Contextual References in Art and Design ",30,"Internal",null,"Art and Design","Unit 36 - Surface Design",60,"Internal"]
["Information and Creative Technology Systems Development and Support","Unit 19 - Computing in the Workplace",60,"Internal",null,null,null,null,null,null,null,null,null,null,null,"Art and Design Product Design","Unit 6 - Investigating Contextual References in Art and Design ",30,"Internal",null,"Art and Design","Unit 37 - Sustainability in Art and Design Practice",30,"Internal"]
[null,null,null,null,null,null,null,null,null,null,null,null,null,null,null,"Art and Design Visual Arts","Unit 6 - Investigating Contextual References in Art and Design ",30,"Internal",null,"Art and Design","Unit 38 - Advertising Briefs",60,"Internal"]
[null,null,null,null,null,null,null,null,null,null,null,null,null,null,null,"Art and Design Visual Communication","Unit 6 - Investigating Contextual References in Art and Design ",30,"Internal",null,"Art and Design","Unit 39 - Modelmaking",60,"Internal"]
[null,null," ",null,null,null,null,null,null,null,null,null,null,null,null,"Business","Unit 9 - Principles of Marketing",30,"External",null,"Art and Design","Unit 40 - Sculpture",60,"Internal"]
["Business","*",null,null,null,null,null,null,null,null,null,null,null,null,null,"CPLD","Unit 4 - Promoting Children’s Positive Behaviour",30,"External",null,"Business","Unit 3 - Promoting a Brand",30,"Internal"]
[null,"*",null,null,null,null,null,null,null,null,null,null,null,null,null,"Construction and the Built Environment","Unit 4 - Construction Processes and Operations",30,"Internal",null,"Business","Unit 4 - Principles of Customer Service",30,"Internal"]
[null,null,null,null,null,null,null,null,null,null,null,null,null,null,null,"Creative Digital Media Production","Unit 21 - Deconstructing Media Products",60,"Internal",null,"Business","Unit 5 - Sales and Personal Selling",30,"Internal"]
[null,null,null,null,null,null,null,null,null,null,null,null,null,null,null,"Engineering","Unit 5 - Engineering Materials",30,"Internal",null,"Business","Unit 6 - Introducing Retail Business",30,"Internal"]
[null,null,null,null,null,null,null,null,null,null,null,null,null,null,null,"Engineering Technology Pathway","Unit 5 - Engineering Materials",30,"Internal"]
[null,null,null,null,null,null,null,null,null,null,null,null,null,null,null,"Engineering Maintenance Pathway","Unit 4 - Engineering Maintenance",30,"Internal"]
[null,null,null,null,null,null,null,null,null,null,null,null,null,null,null,"Engineering Manufacturing Pathway","Unit 5 - Engineering Materials",30,"Internal"]
[null,null,null,null,null,null,null,null,null,null,null,null,null,null,null,"Engineering Mechanical Pathway","Unit 5 - Engineering Materials",30,"Internal"]
[null,null,null,null,null,null,null,null,null,null,null,null,null,null,null,"Health and Social Care","Unit 7 - Equality and Diversity in Health and Social Care",30,"Internal",null,"Business","Unit 7 - Providing Business Support",30,"Internal"]
[null,null,null,null,null,null,null,null,null,null,null,null,null,null,null,"Hospitality","Unit 9 - How the Hospitality Industry Contributes to Healthy Lifestyles",30,"External",null,"Business","Unit 8 - Recruitment, Selection and Employment",30,"Internal"]
[null,null,null,null,null,null,null,null,null,null,null,null,null,null,null,"Information and Creative Technology","Unit 18 - Computational Thinking",30,"Internal"]
[null,null,null,null,null,null,null,null,null,null,null,null,null,null,null,"Information and Creative Technology Computer Science","Unit 17 - Multimedia Products Development",60,"Internal"]
[null,null,null,null,null,null,null,null,null,null,null,null,null,null,null,"Information and Creative Technology Systems Development and Support","Unit 17 - Multimedia Products Development",60,"Internal",null,"Business","Unit 10 - Using Business Documentation",30,"Internal"]
[null,null,null,null,null,null,null,null,null,null,null,null,null,null,null,"Music","Unit 16 - Music Showcase",30,"Internal",null,"Business","Unit 11 - Building Successful Business Teams",30,"Internal"]
[null,null,null,null,null,null,null,null,null,null,null,null,null,null,null,"Performing Arts","Unit 9 - Performance in Context",30,"Internal"]
[null,null,null,null,null,null,null,null,null,null,null,null,null,null,null,"Performing Arts Acting","Unit 8 - The Performing Arts Industry ",30,"External",null,"Business","Unit 12 - Introducing Law and Consumer Rights",30,"Internal"]
[null,null,null,null,null,null,null,null,null,null,null,null,null,null,null,"Performing Arts Dance","Unit 8 - The Performing Arts Industry ",30,"External",null,"Business","Unit 13 - Financial Planning and Forecasting",30,"Internal"]
[null,null,null,null,null,null,null,null,null,null,null,null,null,null,null,"Performing Arts Musical Theatre","Unit 8 - The Performing Arts Industry ",30,"External",null,"Business","Unit 14 - Business Online",60,"Internal"]
[null,null,null,null,null,null,null,null,null,null,null,null,null,null,null,"Performing Arts Production","Unit 8 - The Performing Arts Industry ",30,"External",null,"Business","Unit 15 - Public Sector Business",30,"Internal"]
[null,null,null,null,null,null,null,null,null,null,null,null,null,null,null,"Public Services","Unit 7 - Crime and its Effects on Society and Individuals",60,"Internal",null,"Business","Unit 16 - Enhancing the Customer Experience",30,"Internal"]
[null,null,null,null,null,null,null,null,null,null,null,null,null,null,null,"Sport","Unit 4 - The Sports Performer in Action",30,"Internal"]
[null,null,null,null,null,null,null,null,null,null,null,null,null,null,null,"Sport Outdoor and Adventurous Activities","Unit 4 - The Sports Performer in Action",30,"Internal"]
[null,null,null,null,null,null,null,null,null,null,null,null,null,null,null,"Sport Fitness and Exercise","Unit 4 - The Sports Performer in Action",30,"Internal"]
[null,null,null,null,null,null,null,null,null,null,null,null,null,null,null,"Travel and Tourism","Unit 4 - International Travel and Tourism Destinations ",30,"Internal",null,"Business","Unit 17 - Visual Merchandising in Retail Business",30,"Internal"]
[null,null,null,null,null,null,null,null,null,null,null,null,null,null,null,null,null,null,null,null,"Business","Unit 18 - Small Business Planning",60,"Internal"]
[null,null,null,null,null,null,null,null,null,null,null,null,null,null,null,"Art and Design","Unit 7 - Recording for Creative Intentions in Art and Design",30,"External",null,"Business","Unit 19 - Introducing Project Management",60,"Internal"]
[null,null,null,null,null,null,null,null,null,null,null,null,null,null,null,"Art and Design Design Crafts","Unit 7 - Recording for Creative Intentions in Art and Design",30,"External",null,"Business","Unit 20 - Delivering and Improving Customer Service",60,"Internal"]
[null,null,null,null,null,null,null,null,null,null,null,null,null,null,null,"Art and Design Fashion and Textiles","Unit 7 - Recording for Creative Intentions in Art and Design",30,"External",null,"Business","Unit 21 - Effective Business Communication",60,"Internal"]
[null,null,null,null,null,null,null,null,null,null,null,null,null,null,null,"Art and Design Photography","Unit 7 - Recording for Creative Intentions in Art and Design",30,"External",null,"Business","Unit 22 - Working in Business Teams",60,"Internal"]
[null,null,null,null,null,null,null,null,null,null,null,null,null,null,null,"Art and Design Product Design","Unit 7 - Recording for Creative Intentions in Art and Design",30,"External",null,"Business","Unit 23 - Planning, Forecasting and Recording Business Finances",60,"Internal"]
[null,null,null,null,null,null,null,null,null,null,null,null,null,null,null,"Art and Design Visual Arts","Unit 7 - Recording for Creative Intentions in Art and Design",30,"External",null,"Business","Unit 24 - Work Experience in Business",60,"Internal"]
[null,null,null,null,null,null,null,null,null,null,null,null,null,null,null,"Art and Design Visual Communication","Unit 7 - Recording for Creative Intentions in Art and Design",30,"External",null,"Business","Unit 25 - Introducing International Business",60,"Internal"]
[null,null,null,null,null,null,null,null,null,null,null,null,null,null,null,"Business","Unit 19 - Introducing Project Management",60,"External",null,"Business","Unit 26 - Introducing the Economic Environment",60,"Internal"]
[null,null,null,null,null,null,null,null,null,null,null,null,null,null,null,"Construction and the Built Environment","Unit 11 - Sustainability in Construction",30,"External",null,"Business","Unit 27 - Efficient Business Operations",60,"Internal"]
[null,null,null,null,null,null,null,null,null,null,null,null,null,null,null,"Engineering","Unit 9 - Interpreting and Using Engineering Information",30,"External",null,"Business","Unit 28 - Principles of Procurement and Supply",60,"Internal"]
[null,null,null,null,null,null,null,null,null,null,null,null,null,null,null,"Engineering Technology Pathway","Unit 9 - Interpreting and Using Engineering Information",30,"External"]
[null,null,null,null,null,null,null,null,null,null,null,null,null,null,null,"Engineering Maintenance Pathway","Unit 5 - Engineering Materials",30,"Internal"]
[null,null,null,null,null,null,null,null,null,null,null,null,null,null,null,"Engineering Manufacturing Pathway","Unit 9 - Interpreting and Using Engineering Information",30,"External"]
[null,null,null,null,null,null,null,null,null,null,null,null,null,null,null,"Engineering Mechanical Pathway","Unit 9 - Interpreting and Using Engineering Information",30,"External"]
[null,null,null,null,null,null,null,null,null,null,null,null,null,null,null,"Health and Social Care","Unit 8 - Individual Rights in Health and Social Care",30,"Internal"," ","Business","Unit 29 - Implementing Procurement and Supply in Business",60,"Internal"]
[null,null,null,null,null,null,null,null,null,null,null,null,null,null,null,"Hospitality","Unit 14 - Teamwork in Hospitality",60,"Internal",null,"Business","Unit 30 - Corporate Social Responsibility",30,"Internal"]
[null,null,null,null,null,null,null,null,null,null,null,null,null,null,null,"Information and Creative Technology Computer Science","Unit 18 - Computational Thinking",30,"Internal",null,"Business","Unit 31 - Managing Personal Finances",30,"Internal"]
[null,null,null,null,null,null,null,null,null,null,null,null,null,null,null,"Information and Creative Technology Systems Development and Support","Unit 18 - Computational Thinking",30,"Internal",null,"Business","Unit 32 - Sustainability in the Business Workplace",30,"Internal"]
[null,null,null,null,null,null,null,null,null,null,null,null,null,null,null,null,null,null,null,null,"CPLD","Unit 5 - Health and Safety in Early Years Settings",30,"Internal"]
[null,null,null,null,null,null,null,null,null,null,null,null,null,null,null,null,null,null,null,null,"CPLD","Unit 6 - Supporting Children’s Language and Literacy Development",30,"Internal"]
[null,null,null,null,null,null,null,null,null,null,null,null,null,null,null,"Hospitality","Unit 14 - Teamwork in Hospitality",60,"Internal",null,"CPLD","Unit 7 - Making Healthy Food Choices for Children",30,"Internal"]
[null,null,null,null,null,null,null,null,null,null,null,null,null,null,null,"Information and Creative Technology",null," "," ",null,"CPLD","Unit 8 - Introduction to Working in the Early Years Sector",30,"Internal"]
[null,null,null,null,null,null,null,null,null,null,null,null,null,null,null,"Music","Unit 17 - Researching a Music Topic",60,"Internal",null,"Construction and the Built Environment","Unit 4 - Construction Processes and Operations",30,"Internal"]
[null,null,null,null,null,null,null,null,null,null,null,null,null,null,null,"Performing Arts Acting","Unit 9 - Performance in Context",30,"Internal",null,"Construction and the Built Environment","Unit 5 - Construction Drawing Techniques",30,"Internal"]
[null,null,null,null,null,null,null,null,null,null,null,null,null,null,null,"Public Services","Unit 16 - Employability Skills in the Public Services",30,"Internal",null,"Construction and the Built Environment","Unit 6 - Exploring Carpentry and Joinery Principles and Techniques",30,"Internal"]
[null,null,null,null,null,null,null,null,null,null,null,null,null,null,null,"Performing Arts","Unit 37 - Performing Arts Enterprise",60,"Internal",null,"Construction and the Built Environment","Unit 7 - Exploring Brickwork and Blockwork Principles and Techniques",30,"Internal"]
[null,null,null,null,null,null,null,null,null,null,null,null,null,null,null,null,null,null,null,null,"Construction and the Built Environment","Unit 8 - Exploring Painting and Decorating Principles and Techniques",30,"Internal"]
[null,null,null,null,null,null,null,null,null,null,null,null,null,null,null,null,null,null,null,null,"Construction and the Built Environment","Unit 9 - Exploring Plumbing Principles and Techniques",30,"Internal"]
[null,null,null,null,null,null,null,null,null,null,null,null,null,null,null,null,null,null,null,null,"Construction and the Built Environment","Unit 10 - Exploring Electrical Principles and Techniques",30,"Internal"]
[null,null,null,null,null,null,null,null,null,null,null,null,null,null,null,null,null,null,null,null,"Construction and the Built Environment","Unit 12 - The Construction Industry",30,"Internal"]
[null,null,null,null,null,null,null,null,null,null,null,null,null,null,null,"Performing Arts Dance","Unit 9 - Performance in Context",30,"Internal",null,"Construction and the Built Environment","Unit 13 - Exploring Roofing Principles and Techniques",30,"Internal"]
[null,null,null,null,null,null,null,null,null,null,null,null,null,null,null,"Performing Arts Musical Theatre",null," "," ",null,"Construction and the Built Environment","Unit 14 - Exploring Wall and Floor Tiling Principles and Techniques",30,"Internal"]
[null,null,null,null,null,null,null,null,null,null,null,null,null,null,null,"Performing Arts Production","Unit 9 - Performance in Context",30,"Internal",null,"Construction and the Built Environment","Unit 15 - Exploring Plastering and Dry Lining Principles and Techniques",30,"Internal"]
[null,null,null,null,null,null,null,null,null,null,null,null,null,null,null,"Sport","Unit 5 - Training for Personal Fitness",30,"Internal",null,"Construction and the Built Environment","Unit 16 - Carpentry and Joinery Operations",60,"Internal"]
[null,null,null,null,null,null,null,null,null,null,null,null,null,null,null,"Sport Outdoor and Adventurous Activities","Unit 5 - Training for Personal Fitness",30,"Internal",null,"Construction and the Built Environment","Unit 17 - Brickwork and Blockwork Operations",60,"Internal"]
[null,null,null,null,null,null,null,null,null,null,null,null,null,null,null,"Sport Fitness and Exercise","Unit 5 - Training for Personal Fitness",30,"Internal",null,"Construction and the Built Environment","Unit 18 - Painting and Paperhanging Operations",60,"Internal"]
[null,null,null,null,null,null,null,null,null,null,null,null,null,null,null,"Travel and Tourism","Unit 5 - Factors Affecting Worldwide Travel and Tourism",30,"Internal",null,"Construction and the Built Environment","Unit 19 - Plumbing Operations",30,"Internal"]
[null,null,null,null,null,null,null,null,null,null,null,null,null,null,null,"Applied Science","Unit 3 - Energy and out Universe",30,"Internal",null,"Construction and the Built Environment","Unit 20 - Electrical Operations",30,"Internal"]
[null,null,null,null,null,null,null,null,null,null,null,null,null,null,null,null,null,null,null,null,"Construction and the Built Environment","Unit 21 - Maintenance and Adaptation of Buildings",60,"Internal"]
[null,null,null,null,null,null,null,null,null,null,null,null,null,null,null,null,null,null,null,null,"Construction and the Built Environment","Unit 22 - Tendering and Estimating",60,"Internal"]
[null,null,null,null,null,null,null,null,null,null,null,null,null,null,null,null,null,null,null,null,"Construction and the Built Environment","Unit 23 - Exploring Surveying",60,"Internal"]
[null,null,null,null,null,null,null,null,null,null,null,null,null,null,null,null,null,null,null,null,"Construction and the Built Environment","Unit 24 - Exploring Civil Engineering",60,"Internal"]
[null,null,null,null,null,null,null,null,null,null,null,null,null,null,null,"Art and Design","Unit 16 - Applying Contextual References in Art and Design",30,"Internal",null,"Construction and the Built Environment","Unit 25 - Exploring Building Services Engineering",60,"Internal"]
[null,null,null,null,null,null,null,null,null,null,null,null,null,null,null,"Art and Design Design Crafts","Unit 9 - Design Crafts Briefs",60,"Internal",null,"Construction and the Built Environment","Unit 26 - Exploring Facilities Management",60,"Internal"]
[null,null,null,null,null,null,null,null,null,null,null,null,null,null,null,"Art and Design Fashion and Textiles","Unit 10 - Fashion Briefs",60,"Internal",null,"Construction and the Built Environment","Unit 27 - Construction Work Experience",30,"Internal"]
[null,null,null,null,null,null,null,null,null,null,null,null,null,null,null,"Art and Design Photography","Unit 14 - Photography Briefs",60,"Internal",null,"Construction and the Built Environment","Unit 28 - Communications for Construction and the Built Environment",30,"Internal"]
[null,null,null,null,null,null,null,null,null,null,null,null,null,null,null,"Art and Design Product Design","Unit 15 - Designing for the Future",60,"Internal",null,"Creative Digital Media Production","Unit 3 - Digital Moving Image Production",30,"Internal"]
[null,null,null,null,null,null,null,null,null,null,null,null,null,null,null,"Art and Design Visual Arts","Unit 13 - Visual Arts Briefs",60,"Internal",null,"Creative Digital Media Production","Unit 4 - Digital Audio Production",30,"Internal"]
[null,null,null,null,null,null,null,null,null,null,null,null,null,null,null,"Art and Design Visual Communication","Unit 11 - Graphic Design Briefs",60,"Internal",null,"Creative Digital Media Production","Unit 5 - Digital Publishing Production",30,"Internal"]
[null,null,null,null,null,null,null,null,null,null,null,null,null,null,null,"Construction and the Built Environment","Unit 12 - The Construction Industry",30,"Internal",null,"Creative Digital Media Production","Unit 6 - Website Production",30,"Internal"]
[null,null,null,null,null,null,null,null,null,null,null,null,null,null,null,"Engineering","Unit 10 - Mathematics for Engineering",30,"Internal",null,"Creative Digital Media Production","Unit 7 - Digital Games Production",30,"Internal"]
[null,null,null,null,null,null,null,null,null,null,null,null,null,null,null,"Engineering Technology Pathway","Unit 10 - Mathematics for Engineering",30,"Internal"]
[null,null,null,null,null,null,null,null,null,null,null,null,null,null,null,"Engineering Maintenance Pathway","Unit 9 - Interpreting and Using Engineering Information",30,"External"]
[null,null,null,null,null,null,null,null,null,null,null,null,null,null,null,"Engineering Manufacturing Pathway","Unit 10 - Mathematics for Engineering",30,"Internal"]
[null,null,null,null,null,null,null,null,null,null,null,null,null,null,null,"Engineering Mechanical Pathway","Unit 10 - Mathematics for Engineering",30,"Internal"]
[null,null,null,null,null,null,null,null,null,null,null,null,null,null,null,"Health and Social Care","Unit 9 - Healthy Living ",30,"External",null,"Creative Digital Media Production","Unit 9 - Digital Editing for Moving Image",60,"Internal"]
[null,null,null,null,null,null,null,null,null,null,null,null,null,null,null,"Information and Creative Technology Computer Science","Unit 24 - Software Systems Development",60,"Internal",null,"Creative Digital Media Production","Unit 10 - Digital Photography for a Media Product",60,"Internal"]
[null,null,null,null,null,null,null,null,null,null,null,null,null,null,null,"Information and Creative Technology Systems Development and Support","Unit 22 - Computer Security in Practice",60,"Internal",null,"Creative Digital Media Production","Unit 11 - Animation for Digital Media",60,"Internal"]
[null,null,null,null,null,null,null,null,null,null,null,null,null,null,null,"Performing Arts Acting","Unit 37 - Performing Arts Enterprise",60,"Internal",null,"Creative Digital Media Production","Unit 12 - Digital Audio Editing",30,"Internal"]
[null,null,null,null,null,null,null,null,null,null,null,null,null,null,null,"Performing Arts Dance","Unit 37 - Performing Arts Enterprise",60,"Internal",null,"Creative Digital Media Production","Unit 13 - Graphic Design for Digital Media",30,"Internal"]
[null,null,null,null,null,null,null,null,null,null,null,null,null,null,null,"Performing Arts Production","Unit 37 - Performing Arts Enterprise",60,"Internal",null,"Creative Digital Media Production","Unit 14 - Writing for Digital Media",30,"Internal"]
[null,null,null,null,null,null,null,null,null,null,null,null,null,null,null,"Sport","Unit 7 - Anatomy and Physiology for Sports Performance",30,"External",null,"Creative Digital Media Production","Unit 15 - Digital Games Testing",30,"Internal"]
[null,null,null,null,null,null,null,null,null,null,null,null,null,null,null,"Sport Outdoor and Adventurous Activities","Unit 7 - Anatomy and Physiology for Sports Performance",30,"External",null,"Creative Digital Media Production","Unit 16 - Digital Art for a Media Product",30,"Internal"]
[null,null,null,null,null,null,null,null,null,null,null,null,null,null,null,"Sport Fitness and Exercise","Unit 7 - Anatomy and Physiology for Sports Performance",30,"External",null,"Creative Digital Media Production","Unit 17 - Digital Audio Mixing",30,"Internal"]
[null,null,null,null,null,null,null,null,null,null,null,null,null,null,null,"Travel and Tourism","Unit 7 - Travel and Tourism Business Environments",30,"External",null,"Creative Digital Media Production","Unit 18 - Lighting for Moving Image",30,"Internal"]
[null,null,null,null,null,null,null,null,null,null,null,null,null,null,null,null,null,null,null,null,"Creative Digital Media Production","Unit 19 - Advertising Production",60,"Internal"]
[null,null,null,null,null,null,null,null,null,null,null,null,null,null,null,null,null,null,null,null,"Creative Digital Media Production","Unit 20 - Factual Media Production",60,"Internal"]
[null,null,null,null,null,null,null,null,null,null,null,null,null,null,null,null,null,null,null,null,"Creative Digital Media Production","Unit 21 - Deconstructing Media Products",60,"Internal"]
[null,null,null,null,null,null,null,null,null,null,null,null,null,null,null,"Applied Science","Unit 4 - Biology and our Environment",30,"Internal",null,"Creative Digital Media Production","Unit 22 - Final Digital Production Project",60,"Internal"]
[null,null,null,null,null,null,null,null,null,null,null,null,null,null,null,null,null,null,null,null,"Engineering","Unit 3 - Health and Safety in Engineering",30,"Internal"]
[null,null,null,null,null,null,null,null,null,null,null,null,null,null,null,"Sport Fitness and Exercise","Unit 9 - Lifestyle and Well-being",30,"Internal",null,"Engineering","Unit 4 - Engineering Maintenance",30,"Internal"]
[null,null,null,null,null,null,null,null,null,null,null,null,null,null,null,"Art and Design Design Crafts","Unit 16 - Applying Contextual References in Art and Design",30,"Internal",null,"Engineering","Unit 5 - Engineering Materials",30,"Internal"]
[null,null,null,null,null,null,null,null,null,null,null,null,null,null,null,"Art and Design Fashion and Textiles","Unit 12 - Textile Briefs",60,"Internal",null,"Engineering","Unit 6 - Computer-aided Engineering",30,"Internal"]
[null,null,null,null,null,null,null,null,null,null,null,null,null,null,null,"Art and Design Photography","Unit 16 - Applying Contextual References in Art and Design",30,"Internal",null,"Engineering","Unit 7 - Machining Techniques",60,"Internal"]
[null,null,null,null,null,null,null,null,null,null,null,null,null,null,null,"Art and Design Product Design","Unit 16 - Applying Contextual References in Art and Design",30,"Internal",null,"Engineering","Unit 8 - Electronic Circuit Design and Construction",60,"Internal"]
[null,null,null,null,null,null,null,null,null,null,null,null,null,null,null,"Art and Design Visual Arts","Unit 16 - Applying Contextual References in Art and Design",30,"Internal",null,"Engineering","Unit 11 - Electrical and Mechanical Science for Engineering",30,"Internal"]
[null,null,null,null,null,null,null,null,null,null,null,null,null,null,null,"Art and Design Visual Communication","Unit 16 - Applying Contextual References in Art and Design",30,"Internal",null,"Engineering","Unit 12 - Engineering Design",60,"Internal"]
[null,null,null,null,null,null,null,null,null,null,null,null,null,null,null,"Engineering Maintenance Pathway","Unit 10 - Mathematics for Engineering",30,"Internal"]
[null,null,null,null,null,null,null,null,null,null,null,null,null,null,null,null,null,null,null,null,"Engineering","Unit 13 - Engineering Assembly",30,"Internal"]
[null,null,null,null,null,null,null,null,null,null,null,null,null,null,null,"Sport Fitness and Exercise","Unit 10 - Injury and the Sports Performer",30,"Internal",null,"Engineering","Unit 14 - Vehicle Engines and Other Systems",30,"Internal"]
[null,null,null,null,null,null,null,null,null,null,null,null,null,null,null,"Art and Design Fashion and Textiles","Unit 16 - Applying Contextual References in Art and Design",30,"Internal",null,"Engineering","Unit 15 - Operating an Efficient Workplace",60,"Internal"]
[null,null,null,null,null,null,null,null,null,null,null,null,null,null,null,null,null,null,null,null,"Engineering","Unit 16 - Vehicle Electrical Systems",30,"Internal"]
[null,null,null,null,null,null,null,null,null,null,null,null,null,null,null,"Sport Fitness and Exercise","Unit 15 - Designing Exercise Programmes",60,"Internal",null,"Engineering","Unit 17 - Welding",60,"Internal"]
[null,null,null,null,null,null,null,null,null,null,null,null,null,null,null,null,null,null,null,null,"Engineering","Unit 18 - Computer Numerical Control Programming",60,"Internal"]
[null,null,null,null,null,null,null,null,null,null,null,null,null,null,null,"Applied Science","Unit 8 - Scientific Skills",30,"Internal",null,"Engineering","Unit 19 - Bicycle Servicing and Maintenance",30,"Internal"]
[null,null,null,null,null,null,null,null,null,null,null,null,null,null,null,null,null,null,null,null,"Engineering","Unit 20 - Sustainable Vehicle Power and Structure Design",60,"Internal"]
[null,null,null,null,null,null,null,null,null,null,null,null,null,null,null,null,null,null,null,null,"Engineering","Unit 22 - Continuous Improvement and Problem-Solving",60,"Internal"]
[null,null,null,null,null,null,null,null,null,null,null,null,null,null,null,null,null,null,null,null,"Engineering","Unit 23 - Electronic Devices and Communication Applications",60,"Internal"]
[null,null,null,null,null,null,null,null,null,null,null,null,null,null,null,null,null,null,null,null,"Engineering","Unit 24 - Operation and Maintenance of Mechanical Systems and Components",60,"Internal"]
[null,null,null,null,null,null,null,null,null,null,null,null,null,null,null,null,null,null,null,null,"Engineering","Unit 25 - Operation and Maintenance of Electronic Systems and Components",60,"Internal"]
[null,null,null,null,null,null,null,null,null,null,null,null,null,null,null,null,null,null,null,null,"Engineering","Unit 26 - Operation and Maintenance of Electrical Systems and Components",60,"Internal"]
[null,null,null,null,null,null,null,null,null,null,null,null,null,null,null,null,null,null,null,null,"Engineering","Unit 27 - Operation and Maintenance of Fluid Power Systems and Components",60,"Internal"]
[null,null,null,null,null,null,null,null,null,null,null,null,null,null,null,null,null,null,null,null,"Engineering","Unit 28 - Fabrication Techniques",60,"Internal"]
[null,null,null,null,null,null,null,null,null,null,null,null,null,null,null,null,null,null,null,null,"Engineering","Unit 29 - Casting Techniques",60,"Internal"]
[null,null,null,null,null,null,null,null,null,null,null,null,null,null,null,null,null,null,null,null,"Engineering","Unit 30 - Vehicle Maintenance Techniques",60,"Internal"]
[null,null,null,null,null,null,null,null,null,null,null,null,null,null,null,null,null,null,null,null,"Engineering","Unit 31 - Production Planning for Engineering",30,"Internal"]
[null,null,null,null,null,null,null,null,null,null,null,null,null,null,null,null,null,null,null,null,"Engineering","Unit 32 - Engineering Marking Out",30,"Internal"]
[null,null,null,null,null,null,null,null,null,null,null,null,null,null,null,null,null,null,null,null,"Engineering","Unit 33 - Preparing and Controlling Engineering Manufacturing Operations",30,"Internal"]
[null,null,null,null,null,null,null,null,null,null,null,null,null,null,null,null,null,null,null,null,"Engineering","Unit 34 - PC Software and Hardware in Engineering",60,"Internal"]
[null,null,null,null,null,null,null,null,null,null,null,null,null,null,null,null,null,null,null,null,"Engineering","Unit 35 - Application of Quality Control and Measurement in Engineering",60,"Internal"]
[null,null,null,null,null,null,null,null,null,null,null,null,null,null,null,null,null,null,null,null,"Health and Social Care","Unit 4 - Social Influences on Health and Wellbeing",30,"Internal"]
[null,null,null,null,null,null,null,null,null,null,null,null,null,null,null,null,null,null,null,null,"Health and Social Care","Unit 5 - Promoting Health and Wellbeing",30,"Internal"]
[null,null,null,null,null,null,null,null,null,null,null,null,null,null,null,null," ",null,null,null,"Health and Social Care","Unit 6 - The Impact of Nutrition on Health and Wellbeing",30,"Internal"]
[null,null,null,null,null,null,null,null,null,null,null,null,null,null,null,null,null,null,null,null,"Health and Social Care","Unit 7 - Equality and Diversity in Health and Social Care",30,"Internal"]
[null,null,null,null,null,null,null,null,null,null,null,null,null,null,null,null,null,null,null,null,"Health and Social Care","Unit 8 - Individual Rights in Health and Social Care",30,"Internal"]
[null,null,null,null,null,null,null,null,null,null,null,null,null,null,null,null,null,null,null,null,"Health and Social Care","Unit 10 - Human Body Systems and Care of Disorders",60,"Internal"]
[null,null,null,null,null,null,null,null,null,null,null,null,null,null,null,null,null,null,null,null,"Health and Social Care","Unit 11 - Services in Health and Social Care",30,"Internal"]
[null,null,null,null,null,null,null,null,null,null,null,null,null,null,null,null,null,null,null,null,"Health and Social Care","Unit 12 - Creative and Therapeutic Activities in Health and Social Care",60,"Internal"]
[null,null,null,null,null,null,null,null,null,null,null,null,null,null,null,null,null,null,null,null,"Health and Social Care","Unit 13 - The Health and Social Care Sector",30,"Internal"]
[null,null,null,null,null,null,null,null,null,null,null,null,null,null,null,null,null,null,null,null,"Health and Social Care","Unit 14 - The Early Years Sector",30,"Internal"]
[null,null,null,null,null,null,null,null,null,null,null,null,null,null,null,null,null,null,null,null,"Health and Social Care","Unit 15 - Carrying out a Research Project in Health and Social Care ",60,"Internal"]
[null,null,null,null,null,null,null,null,null,null,null,null,null,null,null,null,null,null,null,null,"Health and Social Care","Unit 16 - Vocational Experience in Health and Social Care",60,"Internal"]
[null,null,null,null,null,null,null,null,null,null,null,null,null,null,null,null,null,null,null,null,"Health and Social Care","Unit 17 - Community Volunteering in Health and Social Care",60,"Internal"]
[null,null,null,null,null,null,null,null,null,null,null,null,null,null,null,null,null,null,null,null,"Health and Social Care","Unit 18 - Child Development and Observation",60,"Internal"]
[null,null,null,null,null,null,null,null,null,null,null,null,null,null,null,null,null,null,null,null,"Health and Social Care","Unit 19 - Skills and Qualities for Working in the Health and Social Care Sector",60,"Internal"]
[null,null,null,null,null,null,null,null,null,null,null,null,null,null,null,null,null,null," ",null,"Health and Social Care","Unit 20 - Understanding Disability",60,"Internal"]
[null,null,null,null,null,null,null,null,null,null,null,null,null,null,null,null,null,null,null,null,"Health and Social Care","Unit 21 - Introduction to Dementia",60,"Internal"]
[null,null,null,null,null,null,null,null,null,null,null,null,null,null,null,null,null,null,null,null,"Health and Social Care","Unit 22 - An Introduction to Basic First Aid",30,"Internal"]
[null,null,null,null,null,null,null,null,null,null,null,null,null,null,null,null,null,null,null,null,"Health and Social Care","Unit 23 - Food Safety in Health and Social Care",30,"Internal"]
[null,null,null,null,null,null,null,null,null,null,null,null,null,null,null,null,null,null,null,null,"Health and Social Care","Unit 24 - Infection Control in Health and Social Care",30,"Internal"]
[null,null,null,null,null,null,null,null,null,null,null,null,null,null,null,null,null,null,null,null,"Health and Social Care","Unit 25 - Using ICT in Health and Social Care",30,"Internal"]
[null,null,null,null,null,null,null,null,null,null,null,null,null,null,null,null,null,null,null,null,"Hospitality","Unit 4 - Costing and Controlling Finances in the Hospitality Industry",30,"Internal"]
[null,null,null,null,null,null,null,null,null,null,null,null,null,null,null,null,null,null,null,null,"Hospitality","Unit 5 - Enterprise in the Hospitality Industry",30,"Internal"]
[null,null,null,null,null,null,null,null,null,null,null,null,null,null,null,null,null,null,null,null,"Hospitality","Unit 6 - Planning, Preparing, Cooking and Finishing Food",30,"Internal"]
[null,null,null,null,null,null,null,null,null,null,null,null,null,null,null,null,null,null,null,null,"Hospitality","Unit 7 - Food and Beverage Service in the Hospitality Industry",30,"Internal"]
[null,null,null,null,null,null,null,null,null,null,null,null,null,null,null,null,null,null,null,null,"Hospitality","Unit 8 - Front Office Services in the Hospitality Industry",30,"Internal"]
[null,null,null,null,null,null,null,null,null,null,null,null,null,null,null,null,null,null,null,null,"Hospitality","Unit 10 - Marketing and Promotion in Hospitality",30,"Internal"]
[null,null,null,null,null,null,null,null,null,null,null,null,null,null,null,null,null,null,null,null,"Hospitality","Unit 11 - Accommodation Services in the Hospitality Industry",30,"Internal"]
[null,null,null,null,null,null,null,null,null,null,null,null,null,null,null,null,null,null,null,null,"Hospitality","Unit 12 - Planning and Running a Hospitality Event",60,"Internal"]
[null,null,null,null,null,null,null,null,null,null,null,null,null,null,null,null,null,null,null,null,"Hospitality","Unit 13 - Contemporary World Food Cooking Skills",60,"Internal"]
[null,null,null,null,null,null,null,null,null,null,null,null,null,null,null,null,null,null,null,null,"Hospitality","Unit 15 - Menu Planning",60,"Internal"]
[null,null,null,null,null,null,null,null,null,null,null,null,null,null,null,null,null,null,null,null,"Hospitality","Unit 16 - Managing Finance in Hospitality",60,"Internal"]
[null,null,null,null,null,null,null,null,null,null,null,null,null,null,null,null,null,null,null,null,"Hospitality","Unit 17 - Alcohol Awareness in Hospitality",30,"Internal"]
[null,null,null,null,null,null,null,null,null,null,null,null,null,null,null,null,null,null,null,null,"Hospitality","Unit 19 - Hospitality Research Project",60,"Internal"]
[null,null,null,null,null,null,null,null,null,null,null,null,null,null,null,null,null,null,null,null,"Hospitality","Unit 20 - Work Experience in Hospitality",60,"Internal"]
[null,null,null,null,null,null,null,null,null,null,null,null,null,null,null,null,null,null,null,null,"Hospitality","Unit 21 - Hospitality Community Volunteering",60,"Internal"]
[null,null,null,null,null,null,null,null,null,null,null,null,null,null,null,null,null,null,null,null,"Hospitality","Unit 22 - Sales and Merchandising in Hospitality",60,"Internal"]
[null,null,null,null,null,null,null,null,null,null,null,null,null,null,null,null,null,null,null,null,"Hospitality","Unit 23 - Barista Skills in Hospitality",30,"Internal"]
[null,null,null,null,null,null,null,null,null,null,null,null,null,null,null,null,null,null,null,null,"Information and Creative Technology","Unit 4 - Creating Digital Animation",30,"Internal"]
[null,null,null,null,null,null,null,null,null,null,null,null,null,null,null,null,null,null,null,null,"Information and Creative Technology","Unit 5 - Creating Digital Audio",30,"Internal"]
[null,null,null,null,null,null,null,null,null,null,null,null,null,null,null,null,null,null,null,null,"Information and Creative Technology","Unit 6 - Creating Digital Graphics",30,"Internal"]
[null,null,null,null,null,null,null,null,null,null,null,null,null,null,null,null,null,null,null,null,"Information and Creative Technology","Unit 7 - Creating Digital Video",30,"Internal"]
[null,null,null,null,null,null,null,null,null,null,null,null,null,null,null,null,null,null,null,null,"Information and Creative Technology","Unit 8 - Mobile Apps Development",30,"Internal"]
[null,null,null,null,null,null,null,null,null,null,null,null,null,null,null,null,null,null,null,null,"Information and Creative Technology","Unit 9 - Spreadsheet Development",30,"Internal"]
[null,null,null,null,null,null,null,null,null,null,null,null,null,null,null,null,null,null,null,null,"Information and Creative Technology","Unit 10 - Database Development",60,"Internal"]
[null,null,null,null,null,null,null,null,null,null,null,null,null,null,null,null,null,null,null,null,"Information and Creative Technology","Unit 11 - Computer Networks",60,"Internal"]
[null,null,null,null,null,null,null,null,null,null,null,null,null,null,null,null,null,null,null,null,"Information and Creative Technology","Unit 12 - Software Development",60,"Internal"]
[null,null,null,null,null,null,null,null,null,null,null,null,null,null,null,null,null,null,null,null,"Information and Creative Technology","Unit 13 - Website Development",60,"Internal"]
[null,null,null,null,null,null,null,null,null,null,null,null,null,null,null,null,null,null,null,null,"Information and Creative Technology","Unit 14 - Installing and Maintaining Computer Hardware",60,"Internal"]
[null,null,null,null,null,null,null,null,null,null,null,null,null,null,null,null,null,null,null,null,"Information and Creative Technology","Unit 15 - Installing and Maintaining Computer Software",60,"Internal"]
[null,null,null,null,null,null,null,null,null,null,null,null,null,null,null,null,null,null,null,null,"Information and Creative Technology","Unit 16 - Automated Computer Systems",60,"Internal"]
[null,null,null,null,null,null,null,null,null,null,null,null,null,null,null,null,null,null,null,null,"Information and Creative Technology","Unit 17 - Multimedia Products Development",60,"Internal"]
[null,null,null,null,null,null,null,null,null,null,null,null,null,null,null,null,null,null,null,null,"Information and Creative Technology"]
[null,null,null,null,null,null,null,null,null,null,null,null,null,null,null,null,null,null,null,null,"Information and Creative Technology"]
[null,null,null,null,null,null,null,null,null,null,null,null,null,null,null,null,null,null,null,null,"Information and Creative Technology","Unit 20 - Building a Personal Computer",30,"Internal"]
[null,null,null,null,null,null,null,null,null,null,null,null,null,null,null,null,null,null,null,null,"Information and Creative Technology","Unit 21 - A Technology Business",60,"Internal"]
[null,null,null,null,null,null,null,null,null,null,null,null,null,null,null,null,null,null,null,null,"Information and Creative Technology","Unit 22 - Computer Security in Practice",60,"Internal"]
[null,null,null,null,null,null,null,null,null,null,null,null,null,null,null,null,null,null,null,null,"Information and Creative Technology","Unit 23 - Computer Systems Support in Practice",60,"Internal"]
[null,null,null,null,null,null,null,null,null,null,null,null,null,null,null,null,null,null,null,null,"Information and Creative Technology","Unit 24 - Software Systems Development",60,"Internal"]
[null,null,null,null,null,null,null,null,null,null,null,null,null,null,null,null,null,null,null,null,"Information and Creative Technology","Unit 25 - IT Work Experience",30,"Internal"]
[null,null,null,null,null,null,null,null,null,null,null,null,null,null,null,null,null,null,null,null,"Music","Unit 3 - Introducing Live Sound",30,"Internal"]
[null,null,null,null,null,null,null,null,null,null,null,null,null,null,null,null,null,null,null,null,"Music","Unit 4 - Introducing Music Composition",30,"Internal"]
[null,null,null,null,null,null,null,null,null,null,null,null,null,null,null,null,null,null,null,null,"Music","Unit 5 - Introducing Music Performance",30,"Internal"]
[null,null,null,null,null,null,null,null,null,null,null,null,null,null,null,null,null,null,null,null,"Music","Unit 6 - Introducing Music Recording",30,"Internal"]
[null,null,null,null,null,null,null,null,null,null,null,null,null,null,null,null,null,null,null,null,"Music","Unit 7 - Introducing Music Sequencing",30,"Internal"]
[null,null,null,null,null,null,null,null,null,null,null,null,null,null,null,null,null,null,null,null,"Music","Unit 9 - Introducing Choral Studies",30,"Internal"]
[null,null,null,null,null,null,null,null,null,null,null,null,null,null,null,null,null,null,null,null,"Music","Unit 10 - Introducing Music Theory",30,"Internal"]
[null,null,null,null,null,null,null,null,null,null,null,null,null,null,null,null,null,null,null,null,"Music","Unit 11 - Developing Solo Music Performance",60,"Internal"]
[null,null,null,null,null,null,null,null,null,null,null,null,null,null,null,null,null,null,null,null,"Music","Unit 12 - The Development of Music",60,"Internal"]
[null,null,null,null,null,null,null,null,null,null,null,null,null,null,null,null,null,null,null,null,"Music","Unit 13 - Developing Music Composition",60,"Internal"]
[null,null,null,null,null,null,null,null,null,null,null,null,null,null,null,null,null,null,null,null,"Music","Unit 14 - Producing a Music Recording",60,"Internal"]
[null,null,null,null,null,null,null,null,null,null,null,null,null,null,null,null,null,null,null,null,"Music","Unit 15 - Music Ensemble",60,"Internal"]
[null,null,null,null,null,null,null,null,null,null,null,null,null,null,null,null,null,null,null,null,"Music","Unit 18 - Developing Modern Music Production Skills",60,"Internal"]
[null,null,null,null,null,null,null,null,null,null,null,null,null,null,null,null,null,null,null,null,"Music","Unit 19 - Developing Music Theory",60,"Internal"]
[null,null,null,null,null,null,null,null,null,null,null,null,null,null,null,null,null,null,null,null,"Music","Unit 20 - Music Fusion",60,"Internal"]
[null,null,null,null,null,null,null,null,null,null,null,null,null,null,null,null,null,null,null,null,"Music","Unit 21 - Music Arrangement",60,"Internal"]
[null,null,null,null,null,null,null,null,null,null,null,null,null,null,null,null,null,null,null,null,"Music","Unit 22 - Exploring Music Improvisation",60,"Internal"]
[null,null,null,null,null,null,null,null,null,null,null,null,null,null,null,null,null,null,null,null,"Music","Unit 23 - Exploring Djing",60,"Internal"]
[null,null,null,null,null,null,null,null,null,null,null,null,null,null,null,null,null,null,null,null,"Music","Unit 24 - Music Promotion",60,"Internal"]
[null,null,null,null,null,null,null,null,null,null,null,null,null,null,null,null,null,null,null,null,"Music","Unit 25 - Digital and Mobile Technology for Music",60,"Internal"]
[null,null,null,null,null,null,null,null,null,null,null,null,null,null,null,null,null,null,null,null,"Music","Unit 26 - Composing for Visual Media",60,"Internal"]
[null,null,null,null,null,null,null,null,null,null,null,null,null,null,null,null,null,null,null,null,"Music","Unit 27 - Enterprise and Music",60,"Internal"]
[null,null,null,null,null,null,null,null,null,null,null,null,null,null,null,null,null,null,null,null,"Performing Arts","Unit 3 - Acting Skills",60,"Internal"]
[null,null,null,null,null,null,null,null,null,null,null,null,null,null,null,null,null,null,null,null,"Performing Arts","Unit 4 - Dance Skills",60,"Internal"]
[null,null,null,null,null,null,null,null,null,null,null,null,null,null,null,null,null,null,null,null,"Performing Arts","Unit 5 - Musical Theatre Skills",60,"Internal"]
[null,null,null,null,null,null,null,null,null,null,null,null,null,null,null,null,null,null,null,null,"Performing Arts","Unit 6 - Music Performance Skills",60,"Internal"]
[null,null,null,null,null,null,null,null,null,null,null,null,null,null,null,null,null,null,null,null,"Performing Arts","Unit 7 - Production Skills for Performance",60,"Internal"]
[null,null,null,null,null,null,null,null,null,null,null,null,null,null,null,null,null,null,null,null,"Performing Arts","Unit 9 - Performance in Context",30,"Internal"]
[null,null,null,null,null,null,null,null,null,null,null,null,null,null,null,null,null,null,null,null,"Performing Arts","Unit 10 - Movement Skills",30,"Internal"]
[null,null,null,null,null,null,null,null,null,null,null,null,null,null,null,null,null,null,null,null,"Performing Arts","Unit 11 - Devising Performance Work",30,"Internal"]
[null,null,null,null,null,null,null,null,null,null,null,null,null,null,null,null,null,null,null,null,"Performing Arts","Unit 12 - Exploring Improvisation",30,"Internal"]
[null,null,null,null,null,null,null,null,null,null,null,null,null,null,null,null,null,null,null,null,"Performing Arts","Unit 13 - Multimedia Performance",30,"Internal"]
[null,null,null,null,null,null,null,null,null,null,null,null,null,null,null,null,null,null,null,null,"Performing Arts","Unit 14 - Voice and Speech for Performers",30,"Internal"]
[null,null,null,null,null,null,null,null,null,null,null,null,null,null,null,null,null,null,null,null,"Performing Arts","Unit 15 - Performing Scripted Plays",30,"Internal"]
[null,null,null,null,null,null,null,null,null,null,null,null,null,null,null,null,null,null,null,null,"Performing Arts","Unit 16 - Contemporary Dance Techniques",30,"Internal"]
[null,null,null,null,null,null,null,null,null,null,null,null,null,null,null,null,null,null,null,null,"Performing Arts","Unit 17 - Exploring Urban Dance Styles",30,"Internal"]
[null,null,null,null,null,null,null,null,null,null,null,null,null,null,null,null,null,null,null,null,"Performing Arts","Unit 18 - Jazz Dance Techniques",30,"Internal"]
[null,null,null,null,null,null,null,null,null,null,null,null,null,null,null,null,null,null,null,null,"Performing Arts","Unit 19 - Design Planning for Performance",30,"Internal"]
[null,null,null,null,null,null,null,null,null,null,null,null,null,null,null,null,null,null,null,null,"Performing Arts","Unit 20 - Realising Costume Design for Performance",30,"Internal"]
[null,null,null,null,null,null,null,null,null,null,null,null,null,null,null,null,null,null,null,null,"Performing Arts","Unit 21 - Realising Set Design for Performance",30,"Internal"]
[null,null,null,null,null,null,null,null,null,null,null,null,null,null,null,null,null,null,null,null,"Performing Arts","Unit 22 - Realising Prop Design for Performance",30,"Internal"]
[null,null,null,null,null,null,null,null,null,null,null,null,null,null,null,null,null,null,null,null,"Performing Arts","Unit 23 - Realising Mask Design for Performance",30,"Internal"]
[null,null,null,null,null,null,null,null,null,null,null,null,null,null,null,null,null,null,null,null,"Performing Arts","Unit 24 - Lighting for Performance",30,"Internal"]
[null,null,null,null,null,null,null,null,null,null,null,null,null,null,null,null,null,null,null,null,"Performing Arts","Unit 25 - Sound for Performance",30,"Internal"]
[null,null,null,null,null,null,null,null,null,null,null,null,null,null,null,null,null,null,null,null,"Performing Arts","Unit 26 - Supporting Performance: Stage Management",30,"Internal"]
[null,null,null,null,null,null,null,null,null,null,null,null,null,null,null,null,null,null,null,null,"Performing Arts","Unit 27 - Supporting Performance: Front of House",30,"Internal"]
[null,null,null,null,null,null,null,null,null,null,null,null,null,null,null,null,null,null,null,null,"Performing Arts","Unit 28 - Make-up for Performance",30,"Internal"]
[null,null,null,null,null,null,null,null,null,null,null,null,null,null,null,null,null,null,null,null,"Performing Arts","Unit 29 - Wardrobe for Stage Performance",30,"Internal"]
[null,null,null,null,null,null,null,null,null,null,null,null,null,null,null,null,null,null,null,null,"Performing Arts","Unit 30 - Choreographing Dance",60,"Internal"]
[null,null,null,null,null,null,null,null,null,null,null,null,null,null,null,null,null,null,null,null,"Performing Arts","Unit 32 - Directing Performance",60,"Internal"]
[null,null,null,null,null,null,null,null,null,null,null,null,null,null,null,null,null,null,null,null,"Performing Arts","Unit 33 - Planning and Managing a Performing Arts Event",60,"Internal"]
[null,null,null,null,null,null,null,null,null,null,null,null,null,null,null,null,null,null,null,null,"Performing Arts","Unit 34 - Multimedia Production",60,"Internal"]
[null,null,null,null,null,null,null,null,null,null,null,null,null,null,null,null,null,null,null,null,"Performing Arts","Unit 35 - Physical Theatre Performance",60,"Internal"]
[null,null,null,null,null,null,null,null,null,null,null,null,null,null,null,null,null,null,null,null,"Performing Arts","Unit 36 - Variety Performance",60,"Internal"]
[null,null,null,null,null,null,null,null,null,null,null,null,null,null,null,null,null,null,null,null,"Performing Arts","Unit 38 - Use of ICT in the Performing Arts",30,"Internal"]
[null,null,null,null,null,null,null,null,null,null,null,null,null,null,null,null,null,null,null,null,"Performing Arts","Unit 39 - Work Experience in the Performing Arts",30,"Internal"]
[null,null,null,null,null,null,null,null,null,null,null,null,null,null,null,null,null,null,null,null,"Performing Arts","Unit 40 - Singing Skills in the Performing Arts",60,"Internal"]
[null,null,null,null,null,null,null,null,null,null,null,null,null,null,null,null,null,null,null,null,"Sport","Unit 3 - The Mind and Sports Performance",30,"Internal"]
[null,null,null,null,null,null,null,null,null,null,null,null,null,null,null,null,null,null,null,null,"Sport","Unit 4 - The Sports Performer in Action",30,"Internal"]
[null,null,null,null,null,null,null,null,null,null,null,null,null,null,null,null,null,null,null,null,"Sport","Unit 5 - Training for Personal Fitness",30,"Internal"]
[null,null,null,null,null,null,null,null,null,null,null,null,null,null,null,null,null,null,null,null,"Sport","Unit 6 - Leading Sports Activities",30,"Internal"]
[null,null,null,null,null,null,null,null,null,null,null,null,null,null,null,null,null,null,null,null,"Sport","Unit 8 - Promotion and Sponsorship in Sport",30,"Internal"]
[null,null,null,null,null,null,null,null,null,null,null,null,null,null,null,null,null,null,null,null,"Sport","Unit 9 - Lifestyle and Well-being",30,"Internal"]
[null,null,null,null,null,null,null,null,null,null,null,null,null,null,null,null,null,null,null,null,"Sport","Unit 10 - Injury and the Sports Performer",30,"Internal"]
[null,null,null,null,null,null,null,null,null,null,null,null,null,null,null,null,null,null,null,null,"Sport","Unit 11 - Running a Sports Event",30,"Internal"]
[null,null,null,null,null,null,null,null,null,null,null,null,null,null,null,null,null,null,null,null,"Sport","Unit 12 - The Sport and Active Leisure Industry",30,"Internal"]
[null,null,null,null,null,null,null,null,null,null,null,null,null,null,null,null,null,null,null,null,"Sport","Unit 13 - Profiling Sports Performance",30,"Internal"]
[]
[null,null,null,null,null,null,null,null,null,null,null,null,null,null,null,null,null,null,null,null,"Sport","Unit 15 - Designing Exercise Programmes",60,"Internal"]
[null,null,null,null,null,null,null,null,null,null,null,null,null,null,null,null,null,null,null,null,"Sport","Unit 16 - The Provision of Sport and Active Leisure",30,"Internal"]
[null,null,null,null,null,null,null,null,null,null,null,null,null,null,null,null,null,null,null,null,"Sport","Unit 17 - Facility Operations for Sport and Leisure",60,"Internal"]
[null,null,null,null,null,null,null,null,null,null,null,null,null,null,null,null,null,null,null,null,"Sport","Unit 18 - Expedition Experience",60,"Internal"]
[null,null,null,null,null,null,null,null,null,null,null,null,null,null,null,null,null,null,null,null,"Sport","Unit 19 - Practical Land-based Outdoor and Adventurous Activities",60,"Internal"]
[null,null,null,null,null,null,null,null,null,null,null,null,null,null,null,null,null,null,null,null,"Sport","Unit 20 - Practical Water-based Outdoor and Adventurous Activities",60,"Internal"]
[null,null,null,null,null,null,null,null,null,null,null,null,null,null,null,null,null,null,null,null,"Sport","Unit 21 - Land-based Outdoor and Adventurous Activity Leadership",60,"Internal"]
[null,null,null,null,null,null,null,null,null,null,null,null,null,null,null,null,null,null,null,null,"Sport","Unit 22 - Water-based Outdoor and Adventurous Activity Leadership",60,"Internal"]
[null,null,null,null,null,null,null,null,null,null,null,null,null,null,null,null,null,null,null,null,"Sport","Unit 23 - Sport Community Volunteering",30,"Internal"]
[null,null,null,null,null,null,null,null,null,null,null,null,null,null,null,null,null,null,null,null,"Sport","Unit 24 - Work Experience in Sport",60,"Internal"]
[null,null,null,null,null,null,null,null,null,null,null,null,null,null,null,null,null,null,null,null,"Travel and Tourism","Unit 3 - The Development of Travel and Tourism in the UK",30,"Internal"]
[null,null,null,null,null,null,null,null,null,null,null,null,null,null,null,null,null,null,null,null,"Travel and Tourism","Unit 5 - Factors Affecting Worldwide Travel and Tourism",30,"Internal"]
[null,null,null,null,null,null,null,null,null,null,null,null,null,null,null,null,null,null,null,null,"Travel and Tourism","Unit 6 -The Travel and Tourism Customer Experience",30,"Internal"]
[null,null,null,null,null,null,null,null,null,null,null,null,null,null,null,null,null,null,null,null,"Travel and Tourism","Unit 8 - Promotion and Sales in Travel and Tourism",30,"Internal"]
[null,null,null,null,null,null,null,null,null,null,null,null,null,null,null,null,null,null,null,null,"Travel and Tourism","Unit 9 - Travel and Tourism Employment Opportunities",30,"Internal"]
[null,null,null,null,null,null,null,null,null,null,null,null,null,null,null,null,null,null,null,null,"Travel and Tourism","Unit 10 - Organising a Travel and Tourism Study Visit",30,"Internal"]
[null,null,null,null,null,null,null,null,null,null,null,null,null,null,null,null,null,null,null,null,"Travel and Tourism","Unit 12 - Marketing in Travel and Tourism",60,"Internal"]
[null,null,null,null,null,null,null,null,null,null,null,null,null,null,null,null,null,null,null,null,"Travel and Tourism","Unit 13 - Airports and Airlines",60,"Internal"]
[null,null,null,null,null,null,null,null,null,null,null,null,null,null,null,null,null,null,null,null,"Travel and Tourism","Unit 14 - Travel and Tourism Research Project",60,"Internal"]
[null,null,null,null,null,null,null,null,null,null,null,null,null,null,null,null,null,null,null,null,"Travel and Tourism","Unit 15 - Work-related Experience in Travel and Tourism",60,"Internal"]
[null,null,null,null,null,null,null,null,null,null,null,null,null,null,null,null,null,null,null,null,"Travel and Tourism","Unit 16 - Holiday Representatives",30,"Internal"]
[null,null,null,null,null,null,null,null,null,null,null,null,null,null,null,null,null,null,null,null,"Travel and Tourism","Unit 17 - UK Travel Agency Operations",30,"Internal"]
[null,null,null,null,null,null,null,null,null,null,null,null,null,null,null,null,null,null,null,null,"Travel and Tourism","Unit 18 - The Cruise Industry",30,"Internal"]
[null,null,null,null,null,null,null,null,null,null,null,null,null,null,null,null,null,null,null,null,"Travel and Tourism","Unit 19 - Hospitality Operations in the Travel and Tourism \nSector",30,"Internal"]
[null,null,null,null,null,null,null,null,null,null,null,null,null,null,null,null,null,null,null,null,"Travel and Tourism","Unit 20 - UK Visitor Attractions",30,"Internal"]
[null,null,null,null,null,null,null,null,null,null,null,null,null,null,null,null,null,null,null,null,"Travel and Tourism","Unit 21 - Overseas Holiday Operations",30,"Internal"]
[null,null,null,null,null,null,null,null,null,null,null,null,null,null,null,null,null,null,null,null,"Applied Science","Unit 9 - Practical Scientific Project ",30,"Internal"]
[null,null,null,null,null,null,null,null,null,null,null,null,null,null,null,null,null,null,null,null,"Applied Science","Unit 10 - World Energy",30,"Internal"]
[null,null,null,null,null,null,null,null,null,null,null,null,null,null,null,null,null,null,null,null,"Applied Science","Unit 11 - How Scientific Theories are Formulated ",30,"Internal"]
[null,null,null,null,null,null,null,null,null,null,null,null,null,null,null,null,null,null,null,null,"Applied Science","Unit 12 - The Living Body",30,"Internal"]
[null,null,null,null,null,null,null,null,null,null,null,null,null,null,null,null,null,null,null,null,"Applied Science","Unit 13 - Monitoring the Environment ",30,"Internal"]
[null,null,null,null,null,null,null,null,null,null,null,null,null,null,null,null,null,null,null,null,"Applied Science","Unit 14 - Growing Plants for Food ",30,"Internal"]
[null,null,null,null,null,null,null,null,null,null,null,null,null,null,null,null,null,null,null,null,"Applied Science","Unit 15 - Investigating a Crime Scene ",30,"Internal"]
[null,null,null,null,null,null,null,null,null,null,null,null,null,null,null,null,null,null,null,null,"Applied Science","Unit 16 - Science in Medicine ",30,"Internal"]
[null,null,null,null,null,null,null,null,null,null,null,null,null,null,null,null,null,null,null,null,"Applied Science","Unit 17 - Understanding Human Behaviour ",30,"Internal"]
[null,null,null,null,null,null,null,null,null,null,null,null,null,null,null,null,null,null,null,null,"Applied Science","Unit 18 - Designing and Making Useful Devices in Science",30,"Internal"]
[null,null,null,null,null,null,null,null,null,null,null,null,null,null,null,null,null,null,null,null,"Applied Science","Unit 19 - Chemical Analysis and Detection ",30,"Internal"]
[null,null,null,null,null,null,null,null,null,null,null,null,null,null,null,null,null,null,null,null,"Applied Science","Unit 20 - Exploring our Universe ",30,"Internal"]
[null,null,null,null,null,null,null,null,null,null,null,null,null,null,null,null,null,null,null,null,"Applied Science","Unit 21 - Electronics in Action",30,"Internal"]
[null,null,null,null,null,null,null,null,null,null,null,null,null,null,null,null,null,null,null,null,"Applied Science","Unit 22 - Biotechnology Procedures and Applications",30,"Internal"]
[null,null,null,null,null,null,null,null,null,null,null,null,null,null,null,null,null,null,null,null,"Applied Science","Unit 23 - Further Chemistry ",30,"Internal"]
[null,null,null,null,null,null,null,null,null,null,null,null,null,null,null,null,null,null,null,null,"Applied Science","Unit 24 - Further Physics",30,"Internal"]
[null,null,null,null,null,null,null,null,null,null,null,null,null,null,null,null,null,null,null,null,"Public Services","Unit 3 - Employment in the Public Services",30,"Internal"]
[null,null,null,null,null,null,null,null,null,null,null,null,null,null,null,null,null,null,null,null,"Public Services","Unit 4 - Public Services and Community Protection",30,"Internal"]
[null,null,null,null,null,null,null,null,null,null,null,null,null,null,null,null,null,null,null,null,"Public Services","Unit 5 - Health, Fitness and Lifestyle for the Public Services",30,"Internal"]
[null,null,null,null,null,null,null,null,null,null,null,null,null,null,null,null,null,null,null,null,"Public Services","Unit 8 - Promotion of Public Service Provision",30,"Internal"]
[null,null,null,null,null,null,null,null,null,null,null,null,null,null,null,null,null,null,null,null,"Public Services","Unit 9 - Community and Cultural Awareness",30,"Internal"]
[null,null,null,null,null,null,null,null,null,null,null,null,null,null,null,null,null,null,null,null,"Public Services","Unit 10 - Adventurous Activities in the Public Services",30,"Internal"]
[null,null,null,null,null,null,null,null,null,null,null,null,null,null,null,null,null,null,null,null,"Public Services","Unit 11 - Sport and Recreation in the Public Services",30,"Internal"]
[null,null,null,null,null,null,null,null,null,null,null,null,null,null,null,null,null,null,null,null,"Public Services","Unit 12 - Land Navigation by Map and Compass",60,"Internal"]
[null,null,null,null,null,null,null,null,null,null,null,null,null,null,null,null,null,null,null,null,"Public Services","Unit 13 - Volunteering for the Public Services",60,"Internal"]
[null,null,null,null,null,null,null,null,null,null,null,null,null,null,null,null,null,null,null,null,"Public Services","Unit 14 - Multi-day Expedition Experience",60,"Internal"]
[null,null,null,null,null,null,null,null,null,null,null,null,null,null,null,null,null,null,null,null,"Public Services","Unit 15 - Health and Safety in the Public Services",60,"Internal"]
[null,null,null,null,null,null,null,null,null,null,null,null,null,null,null,null,null,null,null,null,"Public Services","Unit 16 - Employability Skills in the Public Services",60,"Internal"]
[null,null,null,null,null,null,null,null,null,null,null,null,null,null,null,null,null,null,null,null,"Public Services","Unit 17 - Preparing to Respond to Emergency Incidents",60,"Internal"]
[null,null,null,null,null,null,null,null,null,null,null,null,null,null,null,null,null,null,null,null,"Public Services","Unit 18 - Security Procedures in the Public Services",60,"Internal"]
[null,null,null,null,null,null,null,null,null,null,null,null,null,null,null,null,null,null,null,null,"Public Services","Unit 19 - Carrying out a Project in Public Services",60,"Internal"]
[null,null,null,null,null,null,null,null,null,null,null,null,null,null,null,null,null,null,null,null,"Public Services","Unit 20 - Law and its Impact on the Individual",60,"Internal"]

{"sheet":"Sheet1 (2)","index":14,"n_rows":392,"n_cols":12,"rows_kept":392,"cut":false,"hidden":true,"merged":[[0,3,0,4]]}
["Points","Grade",null,"Rules",null,"Ext Cert","Points","Grade",null,"Diploma","Points","Grade"]
[0,"U",null,"Sector","Core",null,0,"U",null,null,0,"U"]
[1,"U",null,"Art and Design","Units 1 and 2",null,1,"U",null,null,1,"U"]
[2,"U",null,"Art and Design Design Crafts","Units 1 and 2",null,2,"U",null,null,2,"U"]
[3,"U",null,"Art and Design Fashion and Textiles","Units 1 and 2",null,3,"U",null,null,3,"U"]
[4,"U",null,"Art and Design Photography","Units 1 and 2",null,4,"U",null,null,4,"U"]
[5,"U",null,"Art and Design Product Design","Units 1 and 2",null,5,"U",null,null,5,"U"]
[6,"U",null,"Art and Design Visual Arts","Units 1 and 2",null,6,"U",null,null,6,"U"]
[7,"U",null,"Art and Design Visual Communication","Units 1 and 2",null,7,"U",null,null,7,"U"]
[8,"U",null,"Business","Units 1 and 2",null,8,"U",null,null,8,"U"]
[9,"U",null,"CPLD","Units 1 and 2",null,9,"U",null,null,9,"U"]
[10,"U",null,"Construction and the Built Environment","Units 1 and 2",null,10,"U",null,null,10,"U"]
[11,"U",null,"Creative Digital Media Production","Units 1 and 2",null,11,"U",null,null,11,"U"]
[12,"U",null,"Engineering","Units 1 and 2",null,12,"U",null,null,12,"U"]
[13,"U",null,"Health and Social Care","Units 1 and 2",null,13,"U",null,null,13,"U"]
[14,"U",null,"Hospitality","Units 1 and 2",null,14,"U",null,null,14,"U"]
[15,"U",null,"Information and Creative Technology","Units 1 or 2 and 3",null,15,"U",null,null,15,"U"]
[16,"U",null,"Music","Units 1 and 2",null,16,"U",null,null,16,"U"]
[17,"U",null,"Performing Arts Acting","Units 1 and 2",null,17,"U",null,null,17,"U"]
[18,"U",null,"Performing Arts Dance","Units 1 and 2",null,18,"U",null,null,18,"U"]
[19,"U",null,"Performing Arts Musical Theatre","Units 1 and 2",null,19,"U",null,null,19,"U"]
[20,"U",null,"Performing Arts Production","Units 1 and 2",null,20,"U",null,null,20,"U"]
[21,"U",null,"Sport","Units 1 and 2",null,21,"U",null,null,21,"U"]
[22,"U",null,"Travel and Tourism","Units 1 and 2",null,22,"U",null,null,22,"U"]
[23,"U",null,null,null,null,23,"U",null,null,23,"U"]
[24,"U",null,"Sector","Mandatory",null,24,"U",null,null,24,"U"]
[25,"U",null,"Art and Design","Units 6 and 7",null,25,"U",null,null,25,"U"]
[26,"U",null,"Art and Design Design Crafts","Units 6, 7 and 9",null,26,"U",null,null,26,"U"]
[27,"U",null,"Art and Design Fashion and Textiles","Units 6, 7, 10 and 12",null,27,"U",null,null,27,"U"]
[28,"U",null,"Art and Design Photography","Units 6, 7 and 14",null,28,"U",null,null,28,"U"]
[29,"U",null,"Art and Design Product Design","Units 6, 7 and 15",null,29,"U",null,null,29,"U"]
[30,"U",null,"Art and Design Visual Arts","Units 6, 7 and 13",null,30,"U",null,null,30,"U"]
[31,"U",null,"Art and Design Visual Communication","Units 6, 7 and 11",null,31,"U",null,null,31,"U"]
[32,"U",null,"Business","Unit 9",null,32,"U",null,null,32,"U"]
[33,"U",null,"CPLD","Units 3 and 4",null,33,"U",null,null,33,"U"]
[34,"U",null,"Construction and the Built Environment","Units 3 and 11",null,34,"U",null,null,34,"U"]
[35,"U",null,"Creative Digital Media Production","Unit 8",null,35,"U",null,null,35,"U"]
[36,"U",null,"Engineering","Units 9 and 10",null,36,"U",null,null,36,"U"]
[37,"U",null,"Health and Social Care","Units 3 and 9",null,37,"U",null,null,37,"U"]
[38,"U",null,"Hospitality","Units 3 and 9",null,38,"U",null,null,38,"U"]
[39,"U",null,"Information and Creative Technology","None",null,39,"U",null,null,39,"U"]
[40,"U",null,"Music","Unit 8",null,40,"U",null,null,40,"U"]
[41,"U",null,"Performing Arts Acting","Units 3 and 8",null,41,"U",null,null,41,"U"]
[42,"U",null,"Performing Arts Dance","Units 4 and 8",null,42,"U",null,null,42,"U"]
[43,"U",null,"Performing Arts Musical Theatre","Units 5 and 8",null,43,"U",null,null,43,"U"]
[44,"U",null,"Performing Arts Production","Units 7 and 8",null,44,"U",null,null,44,"U"]
[45,"U",null,"Sport","Unit 7",null,45,"U",null,null,45,"U"]
[46,"U",null,"Travel and Tourism","Units 4 and 7",null,46,"U",null,null,46,"U"]
[47,"U",null,null,null,null,47,"U",null,null,47,"U"]
[48,"Level 1",null,"Sector","Optional A",null,48,"U",null,null,48,"U"]
[49,"Level 1",null,"Art and Design","Choose remaining units from this group",null,49,"U",null,null,49,"U"]
[50,"Level 1",null,"Art and Design Design Crafts","Choose remaining units from this group",null,50,"U",null,null,50,"U"]
[51,"Level 1",null,"Art and Design Fashion and Textiles","No optional units available",null,51,"U",null,null,51,"U"]
[52,"Level 1",null,"Art and Design Photography","Choose remaining units from this group",null,52,"U",null,null,52,"U"]
[53,"Level 1",null,"Art and Design Product Design","Choose remaining units from this group NB - Unit 3 cannot be taken with Unit 11",null,53,"U",null,null,53,"U"]
[54,"Level 1",null,"Art and Design Visual Arts","Choose remaining units from this group",null,54,"U",null,null,54,"U"]
[55,"Level 1",null,"Art and Design Visual Communication","Choose remaining units from this group",null,55,"U",null,null,55,"U"]
[56,"Level 1",null,"Business","Choose remaining units from this group",null,56,"U",null,null,56,"U"]
[57,"Level 1",null,"CPLD","Choose remaining units from this group",null,57,"U",null,null,57,"U"]
[58,"Level 1",null,"Construction and the Built Environment","Choose remaining units from this group",null,58,"U",null,null,58,"U"]
[59,"Level 1",null,"Creative Digital Media Production","Learners must complete at least two units from this group",null,59,"U",null,null,59,"U"]
[60,"Level 1",null,"Engineering","Choose remaining units from this group",null,60,"U",null,null,60,"U"]
[61,"Level 1",null,"Health and Social Care","Choose remaining units from this group",null,61,"U",null,null,61,"U"]
[62,"Level 1",null,"Hospitality","At least one unit from this group",null,62,"U",null,null,62,"U"]
[63,"Level 1",null,"Information and Creative Technology","Choose remaining units from this group",null,63,"U",null,null,63,"U"]
[64,"Level 1",null,"Music","Choose three units from this group",null,64,"U",null,null,64,"U"]
[65,"Level 1",null,"Performing Arts Acting","Minimum two units from this group",null,65,"U",null,null,65,"U"]
[66,"Level 1",null,"Performing Arts Dance","Minimum two units from this group",null,66,"U",null,null,66,"U"]
[67,"Level 1",null,"Performing Arts Musical Theatre","Minimum two units from this group",null,67,"U",null,null,67,"U"]
[68,"Level 1",null,"Performing Arts Production","Minimum two units from this group",null,68,"U",null,null,68,"U"]
[69,"Level 1",null,"Sport","Choose remaining units from this group",null,69,"U",null,null,69,"U"]
[70,"Level 1",null,"Travel and Tourism","Choose remaining units from this group",null,70,"U",null,null,70,"U"]
[71,"Level 1",null,null,null,null,71,"U",null,null,71,"U"]
[72,"Level 1",null,"Sector","Optional B",null,72,"Level 1",null,null,72,"U"]
[73,"Level 1",null,"Art and Design","No optional units from this group available",null,73,"Level 1",null,null,73,"U"]
[74,"Level 1",null,"Art and Design Design Crafts","No optional units from this group available",null,74,"Level 1",null,null,74,"U"]
[75,"Level 1",null,"Art and Design Fashion and Textiles","No optional units available",null,75,"Level 1",null,null,75,"U"]
[76,"Level 1",null,"Art and Design Photography","No optional units from this group available",null,76,"Level 1",null,null,76,"U"]
[77,"Level 1",null,"Art and Design Product Design","No optional units from this group available",null,77,"Level 1",null,null,77,"U"]
[78,"Level 1",null,"Art and Design Visual Arts","No optional units from this group available",null,78,"Level 1",null,null,78,"U"]
[79,"Level 1",null,"Art and Design Visual Communication","No optional units from this group available",null,79,"Level 1",null,null,79,"U"]
[80,"Level 1",null,"Business","No optional units from this group available",null,80,"Level 1",null,null,80,"U"]
[81,"Level 1",null,"CPLD","No optional units from this group available",null,81,"Level 1",null,null,81,"U"]
[82,"Level 1",null,"Construction and the Built Environment","No optional units from this group available",null,82,"Level 1",null,null,82,"U"]
[83,"Level 1",null,"Creative Digital Media Production","No limit to units chosen from this group","At least one Optional B Unit Required",83,"Level 1",null,null,83,"U"]
[84,"Level 1",null,"Engineering","No optional units from this group available",null,84,"Level 1",null,null,84,"U"]
[85,"Level 1",null,"Health and Social Care","No optional units from this group available",null,85,"Level 1",null,null,85,"U"]
[86,"Level 1",null,"Hospitality","At least one unit from this group. NB - Unit 6 is a compulsory prerequisite of Unit 13","At least one Optional B Unit Required",86,"Level 1",null,null,86,"U"]
[87,"Level 1",null,"Information and Creative Technology","No optional units from this group available",null,87,"Level 1",null,null,87,"U"]
[88,"Level 1",null,"Music","Choose one unit from this group","One Optional B Unit Required",88,"Level 1",null,null,88,"U"]
[89,"Level 1",null,"Performing Arts Acting","Maximum one unit from this group","One Optional B Unit Required",89,"Level 1",null,null,89,"U"]
[90,"Level 1",null,"Performing Arts Dance","Maximum one unit from this group","One Optional B Unit Required",90,"Level 1",null,null,90,"U"]
[91,"Level 1",null,"Performing Arts Musical Theatre","Maximum one unit from this group","One Optional B Unit Required",91,"Level 1",null,null,91,"U"]
[92,"Level 1",null,"Performing Arts Production","Maximum one unit from this group","One Optional B Unit Required",92,"Level 1",null,null,92,"U"]
[93,"Level 1",null,"Sport","No optional units from this group available",null,93,"Level 1",null,null,93,"U"]
[94,"Level 1",null,"Travel and Tourism","No optional units from this group available",null,94,"Level 1",null,null,94,"U"]
[95,"Level 1",null,null,null,null,95,"Level 1",null,null,95,"U"]
[96,"Level 2 PP",null,"Creative Digital Media Production","At least one Optional B Unit Required",null,96,"Level 1",null,null,96,"Level 1"]
[97,"Level 2 PP",null,"Hospitality","At least one Optional B Unit Required",null,97,"Level 1",null,null,97,"Level 1"]
[98,"Level 2 PP",null,"Music","One Optional B Unit Required",null,98,"Level 1",null,null,98,"Level 1"]
[99,"Level 2 PP",null,"Performing Arts Acting","One Optional B Unit Required",null,99,"Level 1",null,null,99,"Level 1"]
[100,"Level 2 PP",null,"Performing Arts Dance","One Optional B Unit Required",null,100,"Level 1",null,null,100,"Level 1"]
[101,"Level 2 PP",null,"Performing Arts Musical Theatre","One Optional B Unit Required",null,101,"Level 1",null,null,101,"Level 1"]
[102,"Level 2 PP",null,"Performing Arts Production","One Optional B Unit Required",null,102,"Level 1",null,null,102,"Level 1"]
[103,"Level 2 PP",null,null,null,null,103,"Level 1",null,null,103,"Level 1"]
[104,"Level 2 PP",null,"Art and Design",1,null,104,"Level 1",null,null,104,"Level 1"]
[105,"Level 2 PP",null,"Art and Design Design Crafts",2,null,105,"Level 1",null,null,105,"Level 1"]
[106,"Level 2 PP",null,"Art and Design Fashion and Textiles",2,null,106,"Level 1",null,null,106,"Level 1"]
[107,"Level 2 PP",null,"Art and Design Photography",2,null,107,"Level 1",null,null,107,"Level 1"]
[108,"Level 2 PP",null,"Art and Design Product Design",2,null,108,"Level 1",null,null,108,"Level 1"]
[109,"Level 2 PP",null,"Art and Design Visual Arts",2,null,109,"Level 1",null,null,109,"Level 1"]
[110,"Level 2 PP",null,"Art and Design Visual Communication",2,null,110,"Level 1",null,null,110,"Level 1"]
[111,"Level 2 PP",null,"Business",3,null,111,"Level 1",null,null,111,"Level 1"]
[112,"Level 2 PP",null,"CPLD",1,null,112,"Level 1",null,null,112,"Level 1"]
[113,"Level 2 PP",null,"Construction and the Built Environment",1,null,113,"Level 1",null,null,113,"Level 1"]
[114,"Level 2 MP",null,"Creative Digital Media Production",3,null,114,"Level 1",null,null,114,"Level 1"]
[115,"Level 2 MP",null,"Engineering",1,null,115,"Level 1",null,null,115,"Level 1"]
[116,"Level 2 MP",null,"Health and Social Care",1,null,116,"Level 1",null,null,116,"Level 1"]
[117,"Level 2 MP",null,"Hospitality",1,null,117,"Level 1",null,null,117,"Level 1"]
[118,"Level 2 MP",null,"Information and Creative Technology",4,null,118,"Level 1",null,null,118,"Level 1"]
[119,"Level 2 MP",null,"Music",3,null,119,"Level 1",null,null,119,"Level 1"]
[120,"Level 2 MP",null,"Performing Arts Acting",1,null,120,"Level 1",null,null,120,"Level 1"]
[121,"Level 2 MP",null,"Performing Arts Dance",1,null,121,"Level 1",null,null,121,"Level 1"]
[122,"Level 2 MP",null,"Performing Arts Musical Theatre",1,null,122,"Level 1",null,null,122,"Level 1"]
[123,"Level 2 MP",null,"Performing Arts Production",1,null,123,"Level 1",null,null,123,"Level 1"]
[124,"Level 2 MP",null,"Sport",3,null,124,"Level 1",null,null,124,"Level 1"]
[125,"Level 2 MP",null,"Travel and Tourism",1,null,125,"Level 1",null,null,125,"Level 1"]
[126,"Level 2 MP",null,null,null,null,126,"Level 1",null,null,126,"Level 1"]
[127,"Level 2 MP",null,null,null,null,127,"Level 1",null,null,127,"Level 1"]
[128,"Level 2 MP",null,null,null,null,128,"Level 1",null,null,128,"Level 1"]
[129,"Level 2 MP",null,null,null,null,129,"Level 1",null,null,129,"Level 1"]
[130,"Level 2 MP",null,null,null,null,130,"Level 1",null,null,130,"Level 1"]
[131,"Level 2 MP",null,null,null,null,131,"Level 1",null,null,131,"Level 1"]
[132,"Level 2 MM",null,null,null,null,132,"Level 1",null,null,132,"Level 1"]
[133,"Level 2 MM",null,null,null,null,133,"Level 1",null,null,133,"Level 1"]
[134,"Level 2 MM",null,null,null,null,134,"Level 1",null,null,134,"Level 1"]
[135,"Level 2 MM",null,null,null,null,135,"Level 1",null,null,135,"Level 1"]
[136,"Level 2 MM",null,null,null,null,136,"Level 1",null,null,136,"Level 1"]
[137,"Level 2 MM",null,null,null,null,137,"Level 1",null,null,137,"Level 1"]
[138,"Level 2 MM",null,null,null,null,138,"Level 1",null,null,138,"Level 1"]
[139,"Level 2 MM",null,null,null,null,139,"Level 1",null,null,139,"Level 1"]
[140,"Level 2 MM",null,null,null,null,140,"Level 1",null,null,140,"Level 1"]
[141,"Level 2 MM",null,null,null,null,141,"Level 1",null,null,141,"Level 1"]
[142,"Level 2 MM",null,null,null,null,142,"Level 1",null,null,142,"Level 1"]
[143,"Level 2 MM",null,null,null,null,143,"Level 1",null,null,143,"Level 1"]
[144,"Level 2 MM",null,null,null,null,144,"Level 2 PP",null,null,144,"Level 1"]
[145,"Level 2 MM",null,null,null,null,145,"Level 2 PP",null,null,145,"Level 1"]
[146,"Level 2 MM",null,null,null,null,146,"Level 2 PP",null,null,146,"Level 1"]
[147,"Level 2 MM",null,null,null,null,147,"Level 2 PP",null,null,147,"Level 1"]
[148,"Level 2 MM",null,null,null,null,148,"Level 2 PP",null,null,148,"Level 1"]
[149,"Level 2 MM",null,null,null,null,149,"Level 2 PP",null,null,149,"Level 1"]
[150,"Level 2 DM",null,null,null,null,150,"Level 2 PP",null,null,150,"Level 1"]
[151,"Level 2 DM",null,null,null,null,151,"Level 2 PP",null,null,151,"Level 1"]
[152,"Level 2 DM",null,null,null,null,152,"Level 2 PP",null,null,152,"Level 1"]
[153,"Level 2 DM",null,null,null,null,153,"Level 2 PP",null,null,153,"Level 1"]
[154,"Level 2 DM",null,null,null,null,154,"Level 2 PP",null,null,154,"Level 1"]
[155,"Level 2 DM",null,null,null,null,155,"Level 2 PP",null,null,155,"Level 1"]
[156,"Level 2 DM",null,null,null,null,156,"Level 2 PP",null,null,156,"Level 1"]
[157,"Level 2 DM",null,null,null,null,157,"Level 2 PP",null,null,157,"Level 1"]
[158,"Level 2 DM",null,null,null,null,158,"Level 2 PP",null,null,158,"Level 1"]
[159,"Level 2 DM",null,null,null,null,159,"Level 2 PP",null,null,159,"Level 1"]
[160,"Level 2 DM",null,null,null,null,160,"Level 2 PP",null,null,160,"Level 1"]
[161,"Level 2 DM",null,null,null,null,161,"Level 2 PP",null,null,161,"Level 1"]
[162,"Level 2 DM",null,null,null,null,162,"Level 2 PP",null,null,162,"Level 1"]
[163,"Level 2 DM",null,null,null,null,163,"Level 2 PP",null,null,163,"Level 1"]
[164,"Level 2 DM",null,null,null,null,164,"Level 2 PP",null,null,164,"Level 1"]
[165,"Level 2 DM",null,null,null,null,165,"Level 2 PP",null,null,165,"Level 1"]
[166,"Level 2 DM",null,null,null,null,166,"Level 2 PP",null,null,166,"Level 1"]
[167,"Level 2 DM",null,null,null,null,167,"Level 2 PP",null,null,167,"Level 1"]
[168,"Level 2 DD",null,null,null,null,168,"Level 2 PP",null,null,168,"Level 1"]
[169,"Level 2 DD",null,null,null,null,169,"Level 2 PP",null,null,169,"Level 1"]
[170,"Level 2 DD",null,null,null,null,170,"Level 2 PP",null,null,170,"Level 1"]
[171,"Level 2 DD",null,null,null,null,171,"Level 2 PP",null,null,171,"Level 1"]
[172,"Level 2 DD",null,null,null,null,172,"Level 2 PP",null,null,172,"Level 1"]
[173,"Level 2 DD",null,null,null,null,173,"Level 2 PP",null,null,173,"Level 1"]
[174,"Level 2 D*D",null,null,null,null,174,"Level 2 MP",null,null,174,"Level 1"]
[175,"Level 2 D*D",null,null,null,null,175,"Level 2 MP",null,null,175,"Level 1"]
[176,"Level 2 D*D",null,null,null,null,176,"Level 2 MP",null,null,176,"Level 1"]
[177,"Level 2 D*D",null,null,null,null,177,"Level 2 MP",null,null,177,"Level 1"]
[178,"Level 2 D*D",null,null,null,null,178,"Level 2 MP",null,null,178,"Level 1"]
[179,"Level 2 D*D",null,null,null,null,179,"Level 2 MP",null,null,179,"Level 1"]
[180,"Level 2 D*D*",null,null,null,null,180,"Level 2 MP",null,null,180,"Level 1"]
[181,"Level 2 D*D*",null,null,null,null,181,"Level 2 MP",null,null,181,"Level 1"]
[182,"Level 2 D*D*",null,null,null,null,182,"Level 2 MP",null,null,182,"Level 1"]
[183,"Level 2 D*D*",null,null,null,null,183,"Level 2 MP",null,null,183,"Level 1"]
[184,"Level 2 D*D*",null,null,null,null,184,"Level 2 MP",null,null,184,"Level 1"]
[185,"Level 2 D*D*",null,null,null,null,185,"Level 2 MP",null,null,185,"Level 1"]
[186,"Level 2 D*D*",null,null,null,null,186,"Level 2 MP",null,null,186,"Level 1"]
[187,"Level 2 D*D*",null,null,null,null,187,"Level 2 MP",null,null,187,"Level 1"]
[188,"Level 2 D*D*",null,null,null,null,188,"Level 2 MP",null,null,188,"Level 1"]
[189,"Level 2 D*D*",null,null,null,null,189,"Level 2 MP",null,null,189,"Level 1"]
[190,"Level 2 D*D*",null,null,null,null,190,"Level 2 MP",null,null,190,"Level 1"]
[191,"Level 2 D*D*",null,null,null,null,191,"Level 2 MP",null,null,191,"Level 1"]
[192,"Level 2 D*D*",null,null,null,null,192,"Level 2 MP",null,null,192,"Level 2 PP"]
[null,null,null,null,null,null,193,"Level 2 MP",null,null,193,"Level 2 PP"]
[null,null,null,null,null,null,194,"Level 2 MP",null,null,194,"Level 2 PP"]
[null,null,null,null,null,null,195,"Level 2 MP",null,null,195,"Level 2 PP"]
[null,null,null,null,null,null,196,"Level 2 MP",null,null,196,"Level 2 PP"]
[null,null,null,null,null,null,197,"Level 2 MP",null,null,197,"Level 2 PP"]
[null,null,null,null,null,null,198,"Level 2 MP",null,null,198,"Level 2 PP"]
[null,null,null,null,null,null,199,"Level 2 MP",null,null,199,"Level 2 PP"]
[null,null,null,null,null,null,200,"Level 2 MP",null,null,200,"Level 2 PP"]
[null,null,null,null,null,null,201,"Level 2 MP",null,null,201,"Level 2 PP"]
[null,null,null,null,null,null,202,"Level 2 MP",null,null,202,"Level 2 PP"]
[null,null,null,null,null,null,203,"Level 2 MP",null,null,203,"Level 2 PP"]
[null,null,null,null,null,null,204,"Level 2 MM",null,null,204,"Level 2 PP"]
[null,null,null,null,null,null,205,"Level 2 MM",null,null,205,"Level 2 PP"]
[null,null,null,null,null,null,206,"Level 2 MM",null,null,206,"Level 2 PP"]
[null,null,null,null,null,null,207,"Level 2 MM",null,null,207,"Level 2 PP"]
[null,null,null,null,null,null,208,"Level 2 MM",null,null,208,"Level 2 PP"]
[null,null,null,null,null,null,209,"Level 2 MM",null,null,209,"Level 2 PP"]
[null,null,null,null,null,null,210,"Level 2 MM",null,null,210,"Level 2 PP"]
[null,null,null,null,null,null,211,"Level 2 MM",null,null,211,"Level 2 PP"]
[null,null,null,null,null,null,212,"Level 2 MM",null,null,212,"Level 2 PP"]
[null,null,null,null,null,null,213,"Level 2 MM",null,null,213,"Level 2 PP"]
[null,null,null,null,null,null,214,"Level 2 MM",null,null,214,"Level 2 PP"]
[null,null,null,null,null,null,215,"Level 2 MM",null,null,215,"Level 2 PP"]
[null,null,null,null,null,null,216,"Level 2 MM",null,null,216,"Level 2 PP"]
[null,null,null,null,null,null,217,"Level 2 MM",null,null,217,"Level 2 PP"]
[null,null,null,null,null,null,218,"Level 2 MM",null,null,218,"Level 2 PP"]
[null,null,null,null,null,null,219,"Level 2 MM",null,null,219,"Level 2 PP"]
[null,null,null,null,null,null,220,"Level 2 MM",null,null,220,"Level 2 PP"]
[null,null,null,null,null,null,221,"Level 2 MM",null,null,221,"Level 2 PP"]
[null,null,null,null,null,null,222,"Level 2 MM",null,null,222,"Level 2 PP"]
[null,null,null,null,null,null,223,"Level 2 MM",null,null,223,"Level 2 PP"]
[null,null,null,null,null,null,224,"Level 2 MM",null,null,224,"Level 2 PP"]
[null,null,null,null,null,null,225,"Level 2 MM",null,null,225,"Level 2 PP"]
[null,null,null,null,null,null,226,"Level 2 MM",null,null,226,"Level 2 PP"]
[null,null,null,null,null,null,227,"Level 2 MM",null,null,227,"Level 2 PP"]
[null,null,null,null,null,null,228,"Level 2 MM",null,null,228,"Level 2 PP"]
[null,null,null,null,null,null,229,"Level 2 MM",null,null,229,"Level 2 PP"]
[null,null,null,null,null,null,230,"Level 2 MM",null,null,230,"Level 2 PP"]
[null,null,null,null,null,null,231,"Level 2 MM",null,null,231,"Level 2 PP"]
[null,null,null,null,null,null,232,"Level 2 MM",null,null,232,"Level 2 PP"]
[null,null,null,null,null,null,233,"Level 2 MM",null,null,233,"Level 2 PP"]
[null,null,null,null,null,null,234,"Level 2 DM",null,null,234,"Level 2 MP"]
[null,null,null,null,null,null,235,"Level 2 DM",null,null,235,"Level 2 MP"]
[null,null,null,null,null,null,236,"Level 2 DM",null,null,236,"Level 2 MP"]
[null,null,null,null,null,null,237,"Level 2 DM",null,null,237,"Level 2 MP"]
[null,null,null,null,null,null,238,"Level 2 DM",null,null,238,"Level 2 MP"]
[null,null,null,null,null,null,239,"Level 2 DM",null,null,239,"Level 2 MP"]
[null,null,null,null,null,null,240,"Level 2 DM",null,null,240,"Level 2 MP"]
[null,null,null,null,null,null,241,"Level 2 DM",null,null,241,"Level 2 MP"]
[null,null,null,null,null,null,242,"Level 2 DM",null,null,242,"Level 2 MP"]
[null,null,null,null,null,null,243,"Level 2 DM",null,null,243,"Level 2 MP"]
[null,null,null,null,null,null,244,"Level 2 DM",null,null,244,"Level 2 MP"]
[null,null,null,null,null,null,245,"Level 2 DM",null,null,245,"Level 2 MP"]
[null,null,null,null,null,null,246,"Level 2 DM",null,null,246,"Level 2 MP"]
[null,null,null,null,null,null,247,"Level 2 DM",null,null,247,"Level 2 MP"]
[null,null,null,null,null,null,248,"Level 2 DM",null,null,248,"Level 2 MP"]
[null,null,null,null,null,null,249,"Level 2 DM",null,null,249,"Level 2 MP"]
[null,null,null,null,null,null,250,"Level 2 DM",null,null,250,"Level 2 MP"]
[null,null,null,null,null,null,251,"Level 2 DM",null,null,251,"Level 2 MP"]
[null,null,null,null,null,null,252,"Level 2 DM",null,null,252,"Level 2 MP"]
[null,null,null,null,null,null,253,"Level 2 DM",null,null,253,"Level 2 MP"]
[null,null,null,null,null,null,254,"Level 2 DM",null,null,254,"Level 2 MP"]
[null,null,null,null,null,null,255,"Level 2 DM",null,null,255,"Level 2 MP"]
[null,null,null,null,null,null,256,"Level 2 DM",null,null,256,"Level 2 MP"]
[null,null,null,null,null,null,257,"Level 2 DM",null,null,257,"Level 2 MP"]
[null,null,null,null,null,null,258,"Level 2 DM",null,null,258,"Level 2 MP"]
[null,null,null,null,null,null,259,"Level 2 DM",null,null,259,"Level 2 MP"]
[null,null,null,null,null,null,260,"Level 2 DM",null,null,260,"Level 2 MP"]
[null,null,null,null,null,null,261,"Level 2 DM",null,null,261,"Level 2 MP"]
[null,null,null,null,null,null,262,"Level 2 DM",null,null,262,"Level 2 MP"]
[null,null,null,null,null,null,263,"Level 2 DM",null,null,263,"Level 2 MP"]
[null,null,null,null,null,null,264,"Level 2 DD",null,null,264,"Level 2 MP"]
[null,null,null,null,null,null,265,"Level 2 DD",null,null,265,"Level 2 MP"]
[null,null,null,null,null,null,266,"Level 2 DD",null,null,266,"Level 2 MP"]
[null,null,null,null,null,null,267,"Level 2 DD",null,null,267,"Level 2 MP"]
[null,null,null,null,null,null,268,"Level 2 DD",null,null,268,"Level 2 MP"]
[null,null,null,null,null,null,269,"Level 2 DD",null,null,269,"Level 2 MP"]
[null,null,null,null,null,null,270,"Level 2 D*D",null,null,270,"Level 2 MP"]
[null,null,null,null,null,null,271,"Level 2 D*D",null,null,271,"Level 2 MP"]
[null,null,null,null,null,null,272,"Level 2 D*D",null,null,272,"Level 2 MP"]
[null,null,null,null,null,null,273,"Level 2 D*D",null,null,273,"Level 2 MP"]
[null,null,null,null,null,null,274,"Level 2 D*D",null,null,274,"Level 2 MP"]
[null,null,null,null,null,null,275,"Level 2 D*D",null,null,275,"Level 2 MP"]
[null,null,null,null,null,null,276,"Level 2 D*D*",null,null,276,"Level 2 MM"]
[null,null,null,null,null,null,277,"Level 2 D*D*",null,null,277,"Level 2 MM"]
[null,null,null,null,null,null,278,"Level 2 D*D*",null,null,278,"Level 2 MM"]
[null,null,null,null,null,null,279,"Level 2 D*D*",null,null,279,"Level 2 MM"]
[null,null,null,null,null,null,280,"Level 2 D*D*",null,null,280,"Level 2 MM"]
[null,null,null,null,null,null,281,"Level 2 D*D*",null,null,281,"Level 2 MM"]
[null,null,null,null,null,null,282,"Level 2 D*D*",null,null,282,"Level 2 MM"]
[null,null,null,null,null,null,283,"Level 2 D*D*",null,null,283,"Level 2 MM"]
[null,null,null,null,null,null,284,"Level 2 D*D*",null,null,284,"Level 2 MM"]
[null,null,null,null,null,null,285,"Level 2 D*D*",null,null,285,"Level 2 MM"]
[null,null,null,null,null,null,286,"Level 2 D*D*",null,null,286,"Level 2 MM"]
[null,null,null,null,null,null,287,"Level 2 D*D*",null,null,287,"Level 2 MM"]
[null,null,null,null,null,null,288,"Level 2 D*D*",null,null,288,"Level 2 MM"]
[null,null,null,null,null,null,289,"Level 2 D*D*",null,null,289,"Level 2 MM"]
[null,null,null,null,null,null,290,"Level 2 D*D*",null,null,290,"Level 2 MM"]
[null,null,null,null,null,null,291,"Level 2 D*D*",null,null,291,"Level 2 MM"]
[null,null,null,null,null,null,292,"Level 2 D*D*",null,null,292,"Level 2 MM"]
[null,null,null,null,null,null,293,"Level 2 D*D*",null,null,293,"Level 2 MM"]
[null,null,null,null,null,null,294,"Level 2 D*D*",null,null,294,"Level 2 MM"]
[null,null,null,null,null,null,295,"Level 2 D*D*",null,null,295,"Level 2 MM"]
[null,null,null,null,null,null,296,"Level 2 D*D*",null,null,296,"Level 2 MM"]
[null,null,null,null,null,null,297,"Level 2 D*D*",null,null,297,"Level 2 MM"]
[null,null,null,null,null,null,298,"Level 2 D*D*",null,null,298,"Level 2 MM"]
[null,null,null,null,null,null,299,"Level 2 D*D*",null,null,299,"Level 2 MM"]
[null,null,null,null,null,null,300,"Level 2 D*D*",null,null,300,"Level 2 MM"]
[null,null,null,null,null,null,null,null,null,null,301,"Level 2 MM"]
[null,null,null,null,null,null,null,null,null,null,302,"Level 2 MM"]
[null,null,null,null,null,null,null,null,null,null,303,"Level 2 MM"]
[null,null,null,null,null,null,null,null,null,null,304,"Level 2 MM"]
[null,null,null,null,null,null,null,null,null,null,305,"Level 2 MM"]
[null,null,null,null,null,null,null,null,null,null,306,"Level 2 MM"]
[null,null,null,null,null,null,null,null,null,null,307,"Level 2 MM"]
[null,null,null,null,null,null,null,null,null,null,308,"Level 2 MM"]
[null,null,null,null,null,null,null,null,null,null,309,"Level 2 MM"]
[null,null,null,null,null,null,null,null,null,null,310,"Level 2 MM"]
[null,null,null,null,null,null,null,null,null,null,311,"Level 2 MM"]
[null,null,null,null,null,null,null,null,null,null,312,"Level 2 MM"]
[null,null,null,null,null,null,null,null,null,null,313,"Level 2 MM"]
[null,null,null,null,null,null,null,null,null,null,314,"Level 2 MM"]
[null,null,null,null,null,null,null,null,null,null,315,"Level 2 MM"]
[null,null,null,null,null,null,null,null,null,null,316,"Level 2 MM"]
[null,null,null,null,null,null,null,null,null,null,317,"Level 2 MM"]
[null,null,null,null,null,null,null,null,null,null,318,"Level 2 DM"]
[null,null,null,null,null,null,null,null,null,null,319,"Level 2 DM"]
[null,null,null,null,null,null,null,null,null,null,320,"Level 2 DM"]
[null,null,null,null,null,null,null,null,null,null,321,"Level 2 DM"]
[null,null,null,null,null,null,null,null,null,null,322,"Level 2 DM"]
[null,null,null,null,null,null,null,null,null,null,323,"Level 2 DM"]
[null,null,null,null,null,null,null,null,null,null,324,"Level 2 DM"]
[null,null,null,null,null,null,null,null,null,null,325,"Level 2 DM"]
[null,null,null,null,null,null,null,null,null,null,326,"Level 2 DM"]
[null,null,null,null,null,null,null,null,null,null,327,"Level 2 DM"]
[null,null,null,null,null,null,null,null,null,null,328,"Level 2 DM"]
[null,null,null,null,null,null,null,null,null,null,329,"Level 2 DM"]
[null,null,null,null,null,null,null,null,null,null,330,"Level 2 DM"]
[null,null,null,null,null,null,null,null,null,null,331,"Level 2 DM"]
[null,null,null,null,null,null,null,null,null,null,332,"Level 2 DM"]
[null,null,null,null,null,null,null,null,null,null,333,"Level 2 DM"]
[null,null,null,null,null,null,null,null,null,null,334,"Level 2 DM"]
[null,null,null,null,null,null,null,null,null,null,335,"Level 2 DM"]
[null,null,null,null,null,null,null,null,null,null,336,"Level 2 DM"]
[null,null,null,null,null,null,null,null,null,null,337,"Level 2 DM"]
[null,null,null,null,null,null,null,null,null,null,338,"Level 2 DM"]
[null,null,null,null,null,null,null,null,null,null,339,"Level 2 DM"]
[null,null,null,null,null,null,null,null,null,null,340,"Level 2 DM"]
[null,null,null,null,null,null,null,null,null,null,341,"Level 2 DM"]
[null,null,null,null,null,null,null,null,null,null,342,"Level 2 DM"]
[null,null,null,null,null,null,null,null,null,null,343,"Level 2 DM"]
[null,null,null,null,null,null,null,null,null,null,344,"Level 2 DM"]
[null,null,null,null,null,null,null,null,null,null,345,"Level 2 DM"]
[null,null,null,null,null,null,null,null,null,null,346,"Level 2 DM"]
[null,null,null,null,null,null,null,null,null,null,347,"Level 2 DM"]
[null,null,null,null,null,null,null,null,null,null,348,"Level 2 DM"]
[null,null,null,null,null,null,null,null,null,null,349,"Level 2 DM"]
[null,null,null,null,null,null,null,null,null,null,350,"Level 2 DM"]
[null,null,null,null,null,null,null,null,null,null,351,"Level 2 DM"]
[null,null,null,null,null,null,null,null,null,null,352,"Level 2 DM"]
[null,null,null,null,null,null,null,null,null,null,353,"Level 2 DM"]
[null,null,null,null,null,null,null,null,null,null,354,"Level 2 DM"]
[null,null,null,null,null,null,null,null,null,null,355,"Level 2 DM"]
[null,null,null,null,null,null,null,null,null,null,356,"Level 2 DM"]
[null,null,null,null,null,null,null,null,null,null,357,"Level 2 DM"]
[null,null,null,null,null,null,null,null,null,null,358,"Level 2 DM"]
[null,null,null,null,null,null,null,null,null,null,359,"Level 2 DM"]
[null,null,null,null,null,null,null,null,null,null,360,"Level 2 DD"]
[null,null,null,null,null,null,null,null,null,null,361,"Level 2 DD"]
[null,null,null,null,null,null,null,null,null,null,362,"Level 2 DD"]
[null,null,null,null,null,null,null,null,null,null,363,"Level 2 DD"]
[null,null,null,null,null,null,null,null,null,null,364,"Level 2 DD"]
[null,null,null,null,null,null,null,null,null,null,365,"Level 2 DD"]
[null,null,null,null,null,null,null,null,null,null,366,"Level 2 D*D"]
[null,null,null,null,null,null,null,null,null,null,367,"Level 2 D*D"]
[null,null,null,null,null,null,null,null,null,null,368,"Level 2 D*D"]
[null,null,null,null,null,null,null,null,null,null,369,"Level 2 D*D"]
[null,null,null,null,null,null,null,null,null,null,370,"Level 2 D*D"]
[null,null,null,null,null,null,null,null,null,null,371,"Level 2 D*D"]
[null,null,null,null,null,null,null,null,null,null,372,"Level 2 D*D*"]
[null,null,null,null,null,null,null,null,null,null,373,"Level 2 D*D*"]
[null,null,null,null,null,null,null,null,null,null,374,"Level 2 D*D*"]
[null,null,null,null,null,null,null,null,null,null,375,"Level 2 D*D*"]
[null,null,null,null,null,null,null,null,null,null,376,"Level 2 D*D*"]
[null,null,null,null,null,null,null,null,null,null,377,"Level 2 D*D*"]
[null,null,null,null,null,null,null,null,null,null,378,"Level 2 D*D*"]
[null,null,null,null,null,null,null,null,null,null,379,"Level 2 D*D*"]
[null,null,null,null,null,null,null,null,null,null,380,"Level 2 D*D*"]
[null,null,null,null,null,null,null,null,null,null,381,"Level 2 D*D*"]
[null,null,null,null,null,null,null,null,null,null,382,"Level 2 D*D*"]
[null,null,null,null,null,null,null,null,null,null,383,"Level 2 D*D*"]
[null,null,null,null,null,null,null,null,null,null,384,"Level 2 D*D*"]
[null,null,null,null,null,null,null,null,null,null,385]
[null,null,null,null,null,null,null,null,null,null,386]
[null,null,null,null,null,null,null,null,null,null,387]
[null,null,null,null,null,null,null,null,null,null,388]
[null,null,null,null,null,null,null,null,null,null,389]
[null,null,null,null,null,null,null,null,null,null,390]